From https://github.com/parttio/hugerte-for-flow * branch main -> FETCH_HEAD Already on 'main' Your branch is up to date with 'origin/main'. HEAD is now at 823c0a9 [maven-release-plugin] prepare for next development iteration $ mvn versions:set-property -Dproperty=vaadin.version -DnewVersion=25.4-SNAPSHOT -DgenerateBackupPoms=false -B --no-transfer-progress --settings /home/ghrunner/actions-runner/_work/vaadin-ecosystem-build/vaadin-ecosystem-build/settings.xml java 25-tem is already installed. Using java version 25-tem in this shell. [INFO] Scanning for projects... [WARNING] [WARNING] Some problems were encountered while building the effective model for org.parttio:hugerte-for-flow:jar:2.1.1-SNAPSHOT [WARNING] 'build.plugins.plugin.version' for org.springframework.boot:spring-boot-maven-plugin is missing. @ line 142, column 21 [WARNING] [WARNING] It is highly recommended to fix these problems because they threaten the stability of your build. [WARNING] [WARNING] For this reason, future Maven versions might no longer support building such malformed projects. [WARNING] [INFO] [INFO] --------------------< org.parttio:hugerte-for-flow >-------------------- [INFO] Building HugeRTE for Flow 2.1.1-SNAPSHOT [INFO] from pom.xml [INFO] --------------------------------[ jar ]--------------------------------- [INFO] [INFO] --- versions:2.22.0:set-property (default-cli) @ hugerte-for-flow --- [INFO] ------------------------------------------------------------------------ [INFO] BUILD SUCCESS [INFO] ------------------------------------------------------------------------ [INFO] Total time: 2.191 s [INFO] Finished at: 2026-10-06T22:01:38Z [INFO] ------------------------------------------------------------------------ $ mvn versions:set -DnewVersion=25.4-SNAPSHOT -DartifactId=vaadin-bom -DgenerateBackupPoms=false -B --no-transfer-progress --settings /home/ghrunner/actions-runner/_work/vaadin-ecosystem-build/vaadin-ecosystem-build/settings.xml java 25-tem is already installed. Using java version 25-tem in this shell. [INFO] Scanning for projects... [WARNING] [WARNING] Some problems were encountered while building the effective model for org.parttio:hugerte-for-flow:jar:2.1.1-SNAPSHOT [WARNING] 'build.plugins.plugin.version' for org.springframework.boot:spring-boot-maven-plugin is missing. @ line 142, column 21 [WARNING] [WARNING] It is highly recommended to fix these problems because they threaten the stability of your build. [WARNING] [WARNING] For this reason, future Maven versions might no longer support building such malformed projects. [WARNING] [INFO] [INFO] --------------------< org.parttio:hugerte-for-flow >-------------------- [INFO] Building HugeRTE for Flow 2.1.1-SNAPSHOT [INFO] from pom.xml [INFO] --------------------------------[ jar ]--------------------------------- [INFO] [INFO] --- versions:2.22.0:set (default-cli) @ hugerte-for-flow --- [INFO] Searching for local aggregator root... [INFO] Local aggregation root: /home/ghrunner/actions-runner/_work/vaadin-ecosystem-build/vaadin-ecosystem-build/work/hugerte-for-flow [INFO] Processing change of org.parttio:vaadin-bom:2.1.1-SNAPSHOT -> 25.4-SNAPSHOT [INFO] ------------------------------------------------------------------------ [INFO] BUILD SUCCESS [INFO] ------------------------------------------------------------------------ [INFO] Total time: 1.502 s [INFO] Finished at: 2026-10-06T22:01:42Z [INFO] ------------------------------------------------------------------------ $ mvn clean verify -B --no-transfer-progress --settings /home/ghrunner/actions-runner/_work/vaadin-ecosystem-build/vaadin-ecosystem-build/settings.xml java 25-tem is already installed. Using java version 25-tem in this shell. [INFO] Scanning for projects... [WARNING] [WARNING] Some problems were encountered while building the effective model for org.parttio:hugerte-for-flow:jar:2.1.1-SNAPSHOT [WARNING] 'build.plugins.plugin.version' for org.springframework.boot:spring-boot-maven-plugin is missing. @ line 142, column 21 [WARNING] [WARNING] It is highly recommended to fix these problems because they threaten the stability of your build. [WARNING] [WARNING] For this reason, future Maven versions might no longer support building such malformed projects. [WARNING] [INFO] [INFO] --------------------< org.parttio:hugerte-for-flow >-------------------- [INFO] Building HugeRTE for Flow 2.1.1-SNAPSHOT [INFO] from pom.xml [INFO] --------------------------------[ jar ]--------------------------------- [INFO] [INFO] --- clean:3.2.0:clean (default-clean) @ hugerte-for-flow --- [INFO] Deleting /home/ghrunner/actions-runner/_work/vaadin-ecosystem-build/vaadin-ecosystem-build/work/hugerte-for-flow/target [INFO] [INFO] --- resources:3.3.1:resources (default-resources) @ hugerte-for-flow --- [INFO] Copying 192 resources from src/main/resources to target/classes [INFO] [INFO] --- vaadin:25.4-SNAPSHOT:prepare-frontend (default) @ hugerte-for-flow --- [INFO] ClassFinder initialized: 66 urls, 3306 classes scanned, 31 annotation types cached, 577 subtype relationships cached, took 730ms [INFO] Visited 107 classes. Took 146 ms. [INFO] Copying frontend resources from jar files ... [INFO] Visited 68 resources. Took 192 ms. [INFO] [INFO] --- compiler:3.14.1:compile (default-compile) @ hugerte-for-flow --- [INFO] Recompiling the module because of changed source code. [INFO] Compiling 11 source files with javac [debug release 21] to target/classes WARNING: A terminally deprecated method in sun.misc.Unsafe has been called WARNING: sun.misc.Unsafe::objectFieldOffset has been called by lombok.permit.Permit WARNING: Please consider reporting this to the maintainers of class lombok.permit.Permit WARNING: sun.misc.Unsafe::objectFieldOffset will be removed in a future release [INFO] [INFO] --- resources:3.3.1:testResources (default-testResources) @ hugerte-for-flow --- [INFO] Copying 2 resources from src/test/resources to target/test-classes [INFO] [INFO] --- compiler:3.14.1:testCompile (default-testCompile) @ hugerte-for-flow --- [INFO] Recompiling the module because of changed dependency. [INFO] Compiling 38 source files with javac [debug release 21] to target/test-classes [INFO] [INFO] --- surefire:3.2.5:test (default-test) @ hugerte-for-flow --- [INFO] Using auto detected provider org.apache.maven.surefire.junitplatform.JUnitPlatformProvider [INFO] [INFO] ------------------------------------------------------- [INFO] T E S T S [INFO] ------------------------------------------------------- [INFO] Running org.vaadin.hugerte.MopoSmokeTest 22:02:01.637 [main] INFO org.springframework.test.context.support.AnnotationConfigContextLoaderUtils -- Could not detect default configuration classes for test class [org.vaadin.hugerte.MopoSmokeTest]: MopoSmokeTest does not declare any static, non-private, non-final, nested classes annotated with @Configuration. 22:02:01.912 [main] INFO org.springframework.boot.test.context.SpringBootTestContextBootstrapper -- Found @SpringBootConfiguration org.vaadin.hugerte.Application for test class org.vaadin.hugerte.MopoSmokeTest 22:02:02.020 [main] INFO org.springframework.test.context.support.AnnotationConfigContextLoaderUtils -- Could not detect default configuration classes for test class [org.vaadin.hugerte.MopoSmokeTest]: MopoSmokeTest does not declare any static, non-private, non-final, nested classes annotated with @Configuration. 22:02:02.024 [main] INFO org.springframework.boot.test.context.SpringBootTestContextBootstrapper -- Found @SpringBootConfiguration org.vaadin.hugerte.Application for test class org.vaadin.hugerte.MopoSmokeTest . ____ _ __ _ _ /\\ / ___'_ __ _ _(_)_ __ __ _ \ \ \ \ ( ( )\___ | '_ | '_| | '_ \/ _` | \ \ \ \ \\/ ___)| |_)| | | | | || (_| | ) ) ) ) ' |____| .__|_| |_|_| |_\__, | / / / / =========|_|==============|___/=/_/_/_/ :: Spring Boot :: (v4.0.6) 2026-10-06T22:02:04.547Z INFO 334678 --- [ main] org.vaadin.hugerte.MopoSmokeTest : Starting MopoSmokeTest using Java 25 with PID 334678 (started by ghrunner in /home/ghrunner/actions-runner/_work/vaadin-ecosystem-build/vaadin-ecosystem-build/work/hugerte-for-flow) 2026-10-06T22:02:04.552Z INFO 334678 --- [ main] org.vaadin.hugerte.MopoSmokeTest : No active profile set, falling back to 1 default profile: "default" 2026-10-06T22:02:06.309Z INFO 334678 --- [ main] o.s.boot.tomcat.TomcatWebServer : Tomcat initialized with port 0 (http) 2026-10-06T22:02:06.364Z INFO 334678 --- [ main] o.apache.catalina.core.StandardService : Starting service [Tomcat] 2026-10-06T22:02:06.367Z INFO 334678 --- [ main] o.apache.catalina.core.StandardEngine : Starting Servlet engine: [Apache Tomcat/11.0.21] 2026-10-06T22:02:06.440Z INFO 334678 --- [ main] b.w.c.s.WebApplicationContextInitializer : Root WebApplicationContext: initialization completed in 1808 ms 2026-10-06T22:02:08.927Z INFO 334678 --- [ main] c.v.f.s.VaadinServletContextInitializer : Search for subclasses and classes with annotations took 1987 ms 2026-10-06T22:02:09.020Z INFO 334678 --- [ main] c.v.b.d.startup.DevModeStartupListener : Starting dev-mode updaters in /home/ghrunner/actions-runner/_work/vaadin-ecosystem-build/vaadin-ecosystem-build/work/hugerte-for-flow folder. 2026-10-06T22:02:09.073Z INFO 334678 --- [ main] c.v.f.s.f.s.FullDependenciesScanner : Visited 135 classes. Took 28 ms. 2026-10-06T22:02:09.951Z INFO 334678 --- [ main] org.atmosphere.cpr.AtmosphereFramework : Installed AtmosphereHandler com.vaadin.flow.server.communication.PushAtmosphereHandler mapped to context-path: /* 2026-10-06T22:02:09.951Z INFO 334678 --- [ main] org.atmosphere.cpr.AtmosphereFramework : Installed the following AtmosphereInterceptor mapped to AtmosphereHandler com.vaadin.flow.server.communication.PushAtmosphereHandler 2026-10-06T22:02:09.982Z INFO 334678 --- [ main] org.atmosphere.cpr.AtmosphereFramework : Atmosphere is using org.atmosphere.util.VoidAnnotationProcessor for processing annotation 2026-10-06T22:02:09.993Z INFO 334678 --- [ main] org.atmosphere.util.ForkJoinPool : Using ForkJoinPool java.util.concurrent.ForkJoinPool. Set the org.atmosphere.cpr.broadcaster.maxAsyncWriteThreads to -1 to fully use its power. 2026-10-06T22:02:10.003Z INFO 334678 --- [in-dev-server-1] c.v.f.s.frontend.TaskUpdatePackages : Running `npm install` to resolve and optionally download frontend dependencies. This may take a moment, please stand by... 2026-10-06T22:02:10.003Z INFO 334678 --- [ main] org.atmosphere.cpr.AtmosphereFramework : Installed WebSocketProtocol org.atmosphere.websocket.protocol.SimpleHttpProtocol 2026-10-06T22:02:10.013Z INFO 334678 --- [ main] o.a.container.JSR356AsyncSupport : JSR 356 Mapping path /VAADIN/push 2026-10-06T22:02:10.029Z INFO 334678 --- [ main] org.atmosphere.cpr.AtmosphereFramework : Installing Default AtmosphereInterceptors 2026-10-06T22:02:10.030Z INFO 334678 --- [ main] org.atmosphere.cpr.AtmosphereFramework : org.atmosphere.interceptor.CorsInterceptor : CORS Interceptor Support 2026-10-06T22:02:10.030Z INFO 334678 --- [ main] org.atmosphere.cpr.AtmosphereFramework : org.atmosphere.interceptor.CacheHeadersInterceptor : Default Response's Headers Interceptor 2026-10-06T22:02:10.030Z INFO 334678 --- [ main] org.atmosphere.cpr.AtmosphereFramework : org.atmosphere.interceptor.PaddingAtmosphereInterceptor : Browser Padding Interceptor Support 2026-10-06T22:02:10.031Z INFO 334678 --- [ main] org.atmosphere.cpr.AtmosphereFramework : org.atmosphere.interceptor.AndroidAtmosphereInterceptor : Android Interceptor Support 2026-10-06T22:02:10.031Z INFO 334678 --- [ main] org.atmosphere.cpr.AtmosphereFramework : org.atmosphere.interceptor.HeartbeatInterceptor : Heartbeat Interceptor Support 2026-10-06T22:02:10.032Z INFO 334678 --- [ main] org.atmosphere.cpr.AtmosphereFramework : org.atmosphere.interceptor.SSEAtmosphereInterceptor : SSE Interceptor Support 2026-10-06T22:02:10.032Z INFO 334678 --- [ main] org.atmosphere.cpr.AtmosphereFramework : org.atmosphere.interceptor.JSONPAtmosphereInterceptor : JSONP Interceptor Support 2026-10-06T22:02:10.033Z INFO 334678 --- [ main] org.atmosphere.cpr.AtmosphereFramework : org.atmosphere.interceptor.JavaScriptProtocol : Atmosphere JavaScript Protocol 2026-10-06T22:02:10.033Z INFO 334678 --- [ main] org.atmosphere.cpr.AtmosphereFramework : org.atmosphere.interceptor.WebSocketMessageSuspendInterceptor : org.atmosphere.interceptor.WebSocketMessageSuspendInterceptor 2026-10-06T22:02:10.033Z INFO 334678 --- [ main] org.atmosphere.cpr.AtmosphereFramework : org.atmosphere.interceptor.OnDisconnectInterceptor : Browser disconnection detection 2026-10-06T22:02:10.033Z INFO 334678 --- [ main] org.atmosphere.cpr.AtmosphereFramework : org.atmosphere.interceptor.IdleResourceInterceptor : org.atmosphere.interceptor.IdleResourceInterceptor 2026-10-06T22:02:10.034Z INFO 334678 --- [ main] org.atmosphere.cpr.AtmosphereFramework : Set org.atmosphere.cpr.AtmosphereInterceptor.disableDefaults to disable them. 2026-10-06T22:02:10.034Z INFO 334678 --- [ main] org.atmosphere.cpr.AtmosphereFramework : Installed AtmosphereInterceptor CORS Interceptor Support with priority FIRST_BEFORE_DEFAULT 2026-10-06T22:02:10.037Z INFO 334678 --- [ main] org.atmosphere.cpr.AtmosphereFramework : Installed AtmosphereInterceptor Default Response's Headers Interceptor with priority AFTER_DEFAULT 2026-10-06T22:02:10.038Z INFO 334678 --- [ main] org.atmosphere.cpr.AtmosphereFramework : Installed AtmosphereInterceptor Browser Padding Interceptor Support with priority AFTER_DEFAULT 2026-10-06T22:02:10.038Z INFO 334678 --- [ main] org.atmosphere.cpr.AtmosphereFramework : Installed AtmosphereInterceptor Android Interceptor Support with priority AFTER_DEFAULT 2026-10-06T22:02:10.038Z INFO 334678 --- [ main] o.a.interceptor.HeartbeatInterceptor : HeartbeatInterceptor configured with padding value 'X', client frequency 0 seconds and server frequency 60 seconds 2026-10-06T22:02:10.038Z INFO 334678 --- [ main] org.atmosphere.cpr.AtmosphereFramework : Installed AtmosphereInterceptor Heartbeat Interceptor Support with priority AFTER_DEFAULT 2026-10-06T22:02:10.038Z INFO 334678 --- [ main] org.atmosphere.cpr.AtmosphereFramework : Installed AtmosphereInterceptor SSE Interceptor Support with priority AFTER_DEFAULT 2026-10-06T22:02:10.038Z INFO 334678 --- [ main] org.atmosphere.cpr.AtmosphereFramework : Installed AtmosphereInterceptor JSONP Interceptor Support with priority AFTER_DEFAULT 2026-10-06T22:02:10.038Z INFO 334678 --- [ main] org.atmosphere.cpr.AtmosphereFramework : Installed AtmosphereInterceptor Atmosphere JavaScript Protocol with priority AFTER_DEFAULT 2026-10-06T22:02:10.038Z INFO 334678 --- [ main] org.atmosphere.cpr.AtmosphereFramework : Installed AtmosphereInterceptor org.atmosphere.interceptor.WebSocketMessageSuspendInterceptor with priority AFTER_DEFAULT 2026-10-06T22:02:10.039Z INFO 334678 --- [ main] org.atmosphere.cpr.AtmosphereFramework : Installed AtmosphereInterceptor Browser disconnection detection with priority AFTER_DEFAULT 2026-10-06T22:02:10.039Z INFO 334678 --- [ main] org.atmosphere.cpr.AtmosphereFramework : Installed AtmosphereInterceptor org.atmosphere.interceptor.IdleResourceInterceptor with priority BEFORE_DEFAULT 2026-10-06T22:02:10.039Z INFO 334678 --- [ main] org.atmosphere.cpr.AtmosphereFramework : Using EndpointMapper class org.atmosphere.util.DefaultEndpointMapper 2026-10-06T22:02:10.039Z INFO 334678 --- [ main] org.atmosphere.cpr.AtmosphereFramework : Using BroadcasterCache: org.atmosphere.cache.UUIDBroadcasterCache 2026-10-06T22:02:10.039Z INFO 334678 --- [ main] org.atmosphere.cpr.AtmosphereFramework : Default Broadcaster Class: org.atmosphere.cpr.DefaultBroadcaster 2026-10-06T22:02:10.039Z INFO 334678 --- [ main] org.atmosphere.cpr.AtmosphereFramework : Broadcaster Shared List Resources: false 2026-10-06T22:02:10.039Z INFO 334678 --- [ main] org.atmosphere.cpr.AtmosphereFramework : Broadcaster Polling Wait Time 100 2026-10-06T22:02:10.040Z INFO 334678 --- [ main] org.atmosphere.cpr.AtmosphereFramework : Shared ExecutorService supported: true 2026-10-06T22:02:10.040Z INFO 334678 --- [ main] org.atmosphere.cpr.AtmosphereFramework : Messaging ExecutorService Pool Size unavailable - Not instance of ThreadPoolExecutor 2026-10-06T22:02:10.040Z INFO 334678 --- [ main] org.atmosphere.cpr.AtmosphereFramework : Async I/O Thread Pool Size: 200 2026-10-06T22:02:10.040Z INFO 334678 --- [ main] org.atmosphere.cpr.AtmosphereFramework : Using BroadcasterFactory: org.atmosphere.cpr.DefaultBroadcasterFactory 2026-10-06T22:02:10.040Z INFO 334678 --- [ main] org.atmosphere.cpr.AtmosphereFramework : Using AtmosphereResurceFactory: org.atmosphere.cpr.DefaultAtmosphereResourceFactory 2026-10-06T22:02:10.040Z INFO 334678 --- [ main] org.atmosphere.cpr.AtmosphereFramework : Using WebSocketProcessor: org.atmosphere.websocket.DefaultWebSocketProcessor 2026-10-06T22:02:10.042Z INFO 334678 --- [ main] org.atmosphere.cpr.AtmosphereFramework : Invoke AtmosphereInterceptor on WebSocket message true 2026-10-06T22:02:10.042Z INFO 334678 --- [ main] org.atmosphere.cpr.AtmosphereFramework : HttpSession supported: true 2026-10-06T22:02:10.042Z INFO 334678 --- [ main] org.atmosphere.cpr.AtmosphereFramework : Atmosphere is using DefaultAtmosphereObjectFactory for dependency injection and object creation 2026-10-06T22:02:10.042Z INFO 334678 --- [ main] org.atmosphere.cpr.AtmosphereFramework : Atmosphere is using async support: org.atmosphere.container.JSR356AsyncSupport running under container: Apache Tomcat/11.0.21 using jakarta.servlet/3.0 and jsr356/WebSocket API 2026-10-06T22:02:10.043Z INFO 334678 --- [ main] org.atmosphere.cpr.AtmosphereFramework : Atmosphere Framework 3.0.5.slf4jvaadin1 started. 2026-10-06T22:02:10.049Z INFO 334678 --- [ main] org.atmosphere.cpr.AtmosphereFramework : Installed AtmosphereInterceptor Track Message Size Interceptor using | with priority BEFORE_DEFAULT 2026-10-06T22:02:10.128Z INFO 334678 --- [ main] c.v.f.s.DefaultDeploymentConfiguration : Vaadin is running in DEVELOPMENT mode - do not use for production deployments. 2026-10-06T22:02:11.027Z INFO 334678 --- [ main] o.s.boot.tomcat.TomcatWebServer : Tomcat started on port 38179 (http) with context path '/' 2026-10-06T22:02:11.037Z INFO 334678 --- [ main] org.vaadin.hugerte.MopoSmokeTest : Started MopoSmokeTest in 7.072 seconds (process running for 10.724) Mockito is currently self-attaching to enable the inline-mock-maker. This will no longer work in future releases of the JDK. Please add Mockito as an agent to your build as described in Mockito's documentation: https://javadoc.io/doc/org.mockito/mockito-core/latest/org.mockito/org/mockito/Mockito.html#0.3 2026-10-06T22:02:11.424Z INFO 334678 --- [in-dev-server-1] c.v.f.s.frontend.TaskUpdatePackages : using '/home/ghrunner/.vaadin/node-v26.10.0/bin/node /home/ghrunner/.vaadin/node-v26.10.0/lib/node_modules/npm/bin/npm-cli.js --no-update-notifier --no-audit --ignore-scripts install --min-release-age=1 --min-release-age-exclude=@vaadin/*' for frontend package installation OpenJDK 64-Bit Server VM warning: Sharing is only supported for boot loader classes because bootstrap classpath has been appended WARNING: A Java agent has been loaded dynamically (/home/ghrunner/.m2/repository/net/bytebuddy/byte-buddy-agent/1.17.8/byte-buddy-agent-1.17.8.jar) WARNING: If a serviceability tool is in use, please run with -XX:+EnableDynamicAgentLoading to hide this warning WARNING: If a serviceability tool is not in use, please run with -Djdk.instrument.traceUsage for more information WARNING: Dynamic loading of agents will be disallowed by default in a future release 2026-10-06T22:02:13.315Z INFO 334678 --- [o-auto-1-exec-1] o.a.c.c.C.[Tomcat].[localhost].[/] : Initializing Spring DispatcherServlet 'dispatcherServlet' 2026-10-06T22:02:13.315Z INFO 334678 --- [o-auto-1-exec-1] o.s.web.servlet.DispatcherServlet : Initializing Servlet 'dispatcherServlet' 2026-10-06T22:02:13.317Z INFO 334678 --- [o-auto-1-exec-1] o.s.web.servlet.DispatcherServlet : Completed initialization in 0 ms 2026-10-06T22:02:39.804Z INFO 334678 --- [in-dev-server-1] c.v.f.s.frontend.TaskUpdatePackages : Frontend dependencies resolved successfully. 2026-10-06T22:02:40.011Z INFO 334678 --- [in-dev-server-1] c.v.f.s.frontend.TaskCopyFrontendFiles : Copying frontend resources from jar files ... 2026-10-06T22:02:40.141Z WARN 334678 --- [in-dev-server-1] c.v.f.s.frontend.TaskCopyFrontendFiles : Addon 'classes' contains frontend sources under META-INF/resources/frontend/. This location is deprecated; migrate them to META-INF/frontend/ (bundle sources for @JsModule/@CssImport) or to META-INF/resources/ (runtime resources for @StyleSheet/@JavaScript). 2026-10-06T22:02:40.145Z INFO 334678 --- [in-dev-server-1] c.v.f.s.f.TaskCopyLocalFrontendFiles : Copied 2 local frontend files. Took 4 ms. 2026-10-06T22:02:40.200Z INFO 334678 --- [in-dev-server-1] c.v.f.s.f.TaskCopyLocalFrontendFiles : Copied 190 local frontend files. Took 54 ms. 2026-10-06T22:02:40.282Z INFO 334678 --- [in-dev-server-1] c.v.f.s.frontend.TaskCopyFrontendFiles : Visited 20 resources. Took 270 ms. 2026-10-06T22:02:40.285Z INFO 334678 --- [in-dev-server-1] c.v.f.s.f.TaskCopyLocalFrontendFiles : Copying project local frontend resources. 2026-10-06T22:02:40.293Z INFO 334678 --- [in-dev-server-1] c.v.f.s.f.TaskCopyLocalFrontendFiles : Copied 2 local frontend files. Took 6 ms. 2026-10-06T22:02:40.295Z INFO 334678 --- [in-dev-server-1] c.v.f.s.f.TaskCopyLocalFrontendFiles : Copying frontend directory completed. 2026-10-06T22:02:40.702Z INFO 334678 --- [onPool-worker-1] c.v.b.devserver.AbstractDevServerRunner : Starting Vite ------------------ Starting Frontend compilation. ------------------ 2026-10-06T22:02:40.784Z INFO 334678 --- [onPool-worker-1] c.v.b.devserver.AbstractDevServerRunner : Running Vite to compile frontend resources. This may take a moment, please stand by... 2026-10-06T22:02:41.584Z INFO 334678 --- [v-server-output] c.v.b.devserver.DevServerOutputTracker : Cannot optimize dependency: vaadin-flow-client, present in client 'optimizeDeps.include' 2026-10-06T22:02:41.596Z INFO 334678 --- [v-server-output] c.v.b.devserver.DevServerOutputTracker : 2026-10-06T22:02:41.597Z INFO 334678 --- [v-server-output] c.v.b.devserver.DevServerOutputTracker : VITE v8.3.2 ready in 788 ms ----------------- Frontend compiled successfully. ----------------- 2026-10-06T22:02:41.597Z INFO 334678 --- [v-server-output] c.v.b.devserver.DevServerOutputTracker : 2026-10-06T22:02:41.597Z INFO 334678 --- [onPool-worker-1] c.v.b.devserver.AbstractDevServerRunner : Started Vite. Time: 894ms 2026-10-06T22:02:41.597Z INFO 334678 --- [v-server-output] c.v.b.devserver.DevServerOutputTracker : ➜ Local: http://127.0.0.1:43103/VAADIN/ 2026-10-06T22:02:42.259Z INFO 334678 --- [in-dev-server-2] c.v.b.d.DevModeHandlerManagerImpl : Application running at http://localhost:0/ 2026-10-06T22:02:42.365Z INFO 334678 --- [v-server-output] c.v.b.devserver.DevServerOutputTracker : 2026-10-06T22:02:42.365Z INFO 334678 --- [v-server-output] c.v.b.devserver.DevServerOutputTracker : [TypeScript] No errors 2026-10-06T22:02:43.457Z ERROR 334678 --- [o-auto-1-exec-1] c.vaadin.flow.server.StaticFileServer : Unable to load /VAADIN/generated/jar-resources/copilot.js from the frontend dev server: java.io.IOException: Broken pipe 2026-10-06T22:02:43.648Z INFO 334678 --- [v-server-output] c.v.b.devserver.DevServerOutputTracker : [vite] (client) [optimizer] bundling dependencies... 2026-10-06T22:02:45.475Z INFO 334678 --- [v-server-output] c.v.b.devserver.DevServerOutputTracker : [vite] (client) dependency optimized: vaadin-flow-client

Voi jorma!

 

[ERROR] Tests run: 3, Failures: 0, Errors: 1, Skipped: 0, Time elapsed: 52.68 s <<< FAILURE! -- in org.vaadin.hugerte.MopoSmokeTest [ERROR] org.vaadin.hugerte.MopoSmokeTest.smokeTest -- Time elapsed: 32.51 s <<< ERROR! com.microsoft.playwright.TimeoutError: Error { message='Timeout 30000ms exceeded. name='TimeoutError stack='TimeoutError: Timeout 30000ms exceeded. at ProgressController.run (/tmp/playwright-java-17349256282334191473/package/lib/server/progress.js:68:28) at FrameDispatcher._runCommand (/tmp/playwright-java-17349256282334191473/package/lib/server/dispatchers/dispatcher.js:95:31) at DispatcherConnection.dispatch (/tmp/playwright-java-17349256282334191473/package/lib/server/dispatchers/dispatcher.js:329:39) } Call log: - - waiting for locator("#outlet a") to be visible - - waiting for" http://localhost:38179/" navigation to finish... - - navigated to "http://localhost:38179/" at com.microsoft.playwright.impl.WaitableResult.get(WaitableResult.java:52) at com.microsoft.playwright.impl.ChannelOwner.runUntil(ChannelOwner.java:138) at com.microsoft.playwright.impl.Connection.sendMessage(Connection.java:131) at com.microsoft.playwright.impl.ChannelOwner.sendMessage(ChannelOwner.java:124) at com.microsoft.playwright.impl.FrameImpl.waitForSelectorImpl(FrameImpl.java:985) at com.microsoft.playwright.impl.FrameImpl.waitForSelector(FrameImpl.java:975) at com.microsoft.playwright.impl.PageImpl.waitForSelector(PageImpl.java:1547) at com.microsoft.playwright.Page.waitForSelector(Page.java:8333) at in.virit.mopo.Mopo.getViewsReportedByDevMode(Mopo.java:144) at org.vaadin.hugerte.MopoSmokeTest.smokeTest(MopoSmokeTest.java:56) Caused by: com.microsoft.playwright.TimeoutError: Error { message='Timeout 30000ms exceeded. name='TimeoutError stack='TimeoutError: Timeout 30000ms exceeded. at ProgressController.run (/tmp/playwright-java-17349256282334191473/package/lib/server/progress.js:68:28) at FrameDispatcher._runCommand (/tmp/playwright-java-17349256282334191473/package/lib/server/dispatchers/dispatcher.js:95:31) at DispatcherConnection.dispatch (/tmp/playwright-java-17349256282334191473/package/lib/server/dispatchers/dispatcher.js:329:39) } Call log: - - waiting for locator("#outlet a") to be visible - - waiting for" http://localhost:38179/" navigation to finish... - - navigated to "http://localhost:38179/" at com.microsoft.playwright.impl.Connection.dispatch(Connection.java:257) at com.microsoft.playwright.impl.Connection.processOneMessage(Connection.java:214) at com.microsoft.playwright.impl.ChannelOwner.runUntil(ChannelOwner.java:136) ... 8 more [INFO] [INFO] Results: [INFO] [ERROR] Errors: [ERROR] MopoSmokeTest.smokeTest:56 » Timeout Error { message='Timeout 30000ms exceeded. name='TimeoutError stack='TimeoutError: Timeout 30000ms exceeded. at ProgressController.run (/tmp/playwright-java-17349256282334191473/package/lib/server/progress.js:68:28) at FrameDispatcher._runCommand (/tmp/playwright-java-17349256282334191473/package/lib/server/dispatchers/dispatcher.js:95:31) at DispatcherConnection.dispatch (/tmp/playwright-java-17349256282334191473/package/lib/server/dispatchers/dispatcher.js:329:39) } Call log: - - waiting for locator("#outlet a") to be visible - - waiting for" http://localhost:38179/" navigation to finish... - - navigated to "http://localhost:38179/" [INFO] [ERROR] Tests run: 3, Failures: 0, Errors: 1, Skipped: 0 [INFO] [INFO] ------------------------------------------------------------------------ [INFO] BUILD FAILURE [INFO] ------------------------------------------------------------------------ [INFO] Total time: 01:04 min [INFO] Finished at: 2026-10-06T22:02:54Z [INFO] ------------------------------------------------------------------------ [ERROR] Failed to execute goal org.apache.maven.plugins:maven-surefire-plugin:3.2.5:test (default-test) on project hugerte-for-flow: [ERROR] [ERROR] Please refer to /home/ghrunner/actions-runner/_work/vaadin-ecosystem-build/vaadin-ecosystem-build/work/hugerte-for-flow/target/surefire-reports for the individual test results. [ERROR] Please refer to dump files (if any exist) [date].dump, [date]-jvmRun[N].dump and [date].dumpstream. [ERROR] -> [Help 1] [ERROR] [ERROR] To see the full stack trace of the errors, re-run Maven with the -e switch. [ERROR] Re-run Maven using the -X switch to enable full debug logging. [ERROR] [ERROR] For more information about the errors and possible solutions, please read the following articles: [ERROR] [Help 1] http://cwiki.apache.org/confluence/display/MAVEN/MojoFailureException