{
  "vaadin-fullcalendar": {
    "repoUrl": "https://github.com/stefanuebe/vaadin-fullcalendar",
    "originalVersion": null,
    "buildsWithOriginal": false,
    "notifyUsers": [],
    "failureSignature": "unknown",
    "failureSummary": "Build failed (exit code: 1)\n[INFO] ------------------------------------------------------------------------\n[INFO] Total time:  3.878 s\n[INFO] Finished at: 2026-10-10T11:35:29Z\n[ERROR] Failed to execute goal on project fullcalendar2: Could not resolve dependencies for project org.vaadin.stefan:fullcalendar2:jar:8.0.0-SNAPSHOT\n[ERROR] dependency: com.vaadin:browserless-test-junit6:jar:25.3.1 (test)\n[ERROR] \tCould not find artifact com.vaadin:browserless-test-junit6:jar:25.3.1 in Vaadin Directory (https://maven.vaadin.com/vaadin-addons)\n[ERROR] \tCould not find artifact com.vaadin:browserless-test-junit6:jar:25.3.1 in central (https://repo.maven.apache.org/maven2)\n[ERROR] -> [Help 1]\n[ERROR] \n[ERROR] To see the full stack trace of the errors, re-run Maven with the -e switch.\n[ERROR] Re-run Maven using the -X switch to enable full debug logging.\n[ERROR] For more information about the errors and possible solutions, please read the following articles:\n[ERROR] [Help 1] http://cwiki.apache.org/confluence/display/MAVEN/DependencyResolutionException"
  }
}
