fatal: couldn't find remote ref main
error: pathspec 'main' did not match any file(s) known to git
Cloning into 'dramafinder'...
$ mvn versions:set-property -Dproperty=vaadin.version -DnewVersion=25.3.0-rc1 -DgenerateBackupPoms=false -B --no-transfer-progress --settings /home/ghrunner/actions-runner/_work/vaadin-ecosystem-build/vaadin-ecosystem-build/settings.xml
[1;33mjava 25-tem is already installed.[0m
[1;32mUsing java version 25-tem in this shell.[0m
[INFO] Scanning for projects...
[INFO]
[INFO] -------------------< org.vaadin.addons:dramafinder >--------------------
[INFO] Building Drama Finder 1.1.7-SNAPSHOT
[INFO] from pom.xml
[INFO] --------------------------------[ jar ]---------------------------------
[INFO]
[INFO] --- versions:2.22.0:set-property (default-cli) @ dramafinder ---
[INFO] ------------------------------------------------------------------------
[INFO] BUILD SUCCESS
[INFO] ------------------------------------------------------------------------
[INFO] Total time: 1.696 s
[INFO] Finished at: 2026-09-21T13:37:29Z
[INFO] ------------------------------------------------------------------------
$ mvn versions:set -DnewVersion=25.3.0-rc1 -DartifactId=vaadin-bom -DgenerateBackupPoms=false -B --no-transfer-progress --settings /home/ghrunner/actions-runner/_work/vaadin-ecosystem-build/vaadin-ecosystem-build/settings.xml
[1;33mjava 25-tem is already installed.[0m
[1;32mUsing java version 25-tem in this shell.[0m
[INFO] Scanning for projects...
[INFO]
[INFO] -------------------< org.vaadin.addons:dramafinder >--------------------
[INFO] Building Drama Finder 1.1.7-SNAPSHOT
[INFO] from pom.xml
[INFO] --------------------------------[ jar ]---------------------------------
[INFO]
[INFO] --- versions:2.22.0:set (default-cli) @ dramafinder ---
[INFO] Searching for local aggregator root...
[INFO] Local aggregation root: /home/ghrunner/actions-runner/_work/vaadin-ecosystem-build/vaadin-ecosystem-build/work/dramafinder
[INFO] Processing change of org.vaadin.addons:vaadin-bom:1.1.7-SNAPSHOT -> 25.3.0-rc1
[INFO] ------------------------------------------------------------------------
[INFO] BUILD SUCCESS
[INFO] ------------------------------------------------------------------------
[INFO] Total time: 1.337 s
[INFO] Finished at: 2026-09-21T13:37:33Z
[INFO] ------------------------------------------------------------------------
$ mvn clean verify -B --no-transfer-progress --settings /home/ghrunner/actions-runner/_work/vaadin-ecosystem-build/vaadin-ecosystem-build/settings.xml
[1;33mjava 25-tem is already installed.[0m
[1;32mUsing java version 25-tem in this shell.[0m
[INFO] Scanning for projects...
[INFO]
[INFO] -------------------< org.vaadin.addons:dramafinder >--------------------
[INFO] Building Drama Finder 1.1.7-SNAPSHOT
[INFO] from pom.xml
[INFO] --------------------------------[ jar ]---------------------------------
[INFO]
[INFO] --- clean:3.2.0:clean (default-clean) @ dramafinder ---
[INFO]
[INFO] --- jacoco:0.8.14:prepare-agent (default) @ dramafinder ---
[INFO] argLine set to -javaagent:/home/ghrunner/.m2/repository/org/jacoco/org.jacoco.agent/0.8.14/org.jacoco.agent-0.8.14-runtime.jar=destfile=/home/ghrunner/actions-runner/_work/vaadin-ecosystem-build/vaadin-ecosystem-build/work/dramafinder/target/jacoco.exec
[INFO]
[INFO] --- resources:3.3.1:copy-resources (bundle-agent-docs) @ dramafinder ---
[INFO] Copying 1 resource from skills/vaadin-playwright-test to target/classes/META-INF/dramafinder
[INFO] Copying 1 resource from skills/vaadin-playwright-screenshot to target/classes/META-INF/dramafinder
[INFO]
[INFO] --- resources:3.3.1:resources (default-resources) @ dramafinder ---
[INFO] Copying 1 resource from src/main/resources to target/classes
[INFO]
[INFO] --- compiler:3.13.0:compile (default-compile) @ dramafinder ---
[INFO] Recompiling the module because of changed source code.
[INFO] Compiling 90 source files with javac [debug release 21] to target/classes
[INFO]
[INFO] --- resources:3.3.1:testResources (default-testResources) @ dramafinder ---
[INFO] Copying 3 resources from src/test/resources to target/test-classes
[INFO]
[INFO] --- compiler:3.13.0:testCompile (default-testCompile) @ dramafinder ---
[INFO] Recompiling the module because of changed dependency.
[INFO] Compiling 150 source files with javac [debug release 21] to target/test-classes
[WARNING] /home/ghrunner/actions-runner/_work/vaadin-ecosystem-build/vaadin-ecosystem-build/work/dramafinder/src/test/java/org/vaadin/addons/dramafinder/tests/testuis/ButtonView.java:[72,34] BUTTON in com.vaadin.flow.component.icon.VaadinIcon has been deprecated and marked for removal
[WARNING] /home/ghrunner/actions-runner/_work/vaadin-ecosystem-build/vaadin-ecosystem-build/work/dramafinder/src/test/java/org/vaadin/addons/dramafinder/tests/testuis/DialogView.java:[64,15] setModal(boolean) in com.vaadin.flow.component.dialog.Dialog has been deprecated and marked for removal
[WARNING] /home/ghrunner/actions-runner/_work/vaadin-ecosystem-build/vaadin-ecosystem-build/work/dramafinder/src/test/java/org/vaadin/addons/dramafinder/tests/testuis/LoginFormView.java:[52,35] createDefault() in com.vaadin.flow.component.login.LoginI18n has been deprecated and marked for removal
[WARNING] /home/ghrunner/actions-runner/_work/vaadin-ecosystem-build/vaadin-ecosystem-build/work/dramafinder/src/test/java/org/vaadin/addons/dramafinder/tests/testuis/LoginOverlayView.java:[54,35] createDefault() in com.vaadin.flow.component.login.LoginI18n has been deprecated and marked for removal
[WARNING] /home/ghrunner/actions-runner/_work/vaadin-ecosystem-build/vaadin-ecosystem-build/work/dramafinder/src/test/java/org/vaadin/addons/dramafinder/tests/testuis/SideNavigationElementView.java:[30,44] ACCORDION_MENU in com.vaadin.flow.component.icon.VaadinIcon has been deprecated and marked for removal
[INFO] /home/ghrunner/actions-runner/_work/vaadin-ecosystem-build/vaadin-ecosystem-build/work/dramafinder/src/test/java/org/vaadin/addons/dramafinder/tests/testuis/TreeGridView.java: Some input files use or override a deprecated API.
[INFO] /home/ghrunner/actions-runner/_work/vaadin-ecosystem-build/vaadin-ecosystem-build/work/dramafinder/src/test/java/org/vaadin/addons/dramafinder/tests/testuis/TreeGridView.java: Recompile with -Xlint:deprecation for details.
[INFO]
[INFO] --- surefire:3.2.5:test (default-test) @ dramafinder ---
[INFO] Using auto detected provider org.apache.maven.surefire.junitplatform.JUnitPlatformProvider
[INFO]
[INFO] -------------------------------------------------------
[INFO] T E S T S
[INFO] -------------------------------------------------------
[INFO] Running org.vaadin.addons.dramafinder.element.utils.NumberUtilsTest
[INFO] Running org.vaadin.addons.dramafinder.DocumentationBundledInJarTest
[INFO] Tests run: 8, Failures: 0, Errors: 0, Skipped: 0, Time elapsed: 0.117 s -- in org.vaadin.addons.dramafinder.element.utils.NumberUtilsTest
[INFO] Tests run: 0, Failures: 0, Errors: 0, Skipped: 0, Time elapsed: 0.124 s -- in org.vaadin.addons.dramafinder.DocumentationBundledInJarTest
[INFO]
[INFO] Results:
[INFO]
[INFO] Tests run: 8, Failures: 0, Errors: 0, Skipped: 0
[INFO]
[INFO]
[INFO] --- jacoco:0.8.14:report (report) @ dramafinder ---
[INFO] Loading execution data file /home/ghrunner/actions-runner/_work/vaadin-ecosystem-build/vaadin-ecosystem-build/work/dramafinder/target/jacoco.exec
[INFO] Analyzed bundle 'Drama Finder' with 94 classes
[INFO]
[INFO] --- jar:3.4.2:jar (default-jar) @ dramafinder ---
[INFO] Building jar: /home/ghrunner/actions-runner/_work/vaadin-ecosystem-build/vaadin-ecosystem-build/work/dramafinder/target/dramafinder-1.1.7-SNAPSHOT.jar
[INFO]
[INFO] --- failsafe:3.5.4:integration-test (default) @ dramafinder ---
[INFO] Using auto detected provider org.apache.maven.surefire.junitplatform.JUnitPlatformProvider
[INFO]
[INFO] -------------------------------------------------------
[INFO] T E S T S
[INFO] -------------------------------------------------------
[INFO] Running org.vaadin.addons.dramafinder.tests.it.TimePickerViewIT
[INFO] Running org.vaadin.addons.dramafinder.tests.it.SimpleExampleViewIT
13:37:53.488 [ForkJoinPool-1-worker-2] INFO org.springframework.test.context.support.AnnotationConfigContextLoaderUtils -- Could not detect default configuration classes for test class [org.vaadin.addons.dramafinder.tests.it.TimePickerViewIT]: TimePickerViewIT does not declare any static, non-private, non-final, nested classes annotated with @Configuration.
13:37:53.486 [ForkJoinPool-1-worker-1] INFO org.springframework.test.context.support.AnnotationConfigContextLoaderUtils -- Could not detect default configuration classes for test class [org.vaadin.addons.dramafinder.tests.it.SimpleExampleViewIT]: SimpleExampleViewIT does not declare any static, non-private, non-final, nested classes annotated with @Configuration.
13:37:53.776 [ForkJoinPool-1-worker-1] INFO org.springframework.boot.test.context.SpringBootTestContextBootstrapper -- Found @SpringBootConfiguration org.vaadin.addons.dramafinder.tests.TestServer for test class org.vaadin.addons.dramafinder.tests.it.SimpleExampleViewIT
13:37:53.778 [ForkJoinPool-1-worker-2] INFO org.springframework.boot.test.context.SpringBootTestContextBootstrapper -- Found @SpringBootConfiguration org.vaadin.addons.dramafinder.tests.TestServer for test class org.vaadin.addons.dramafinder.tests.it.TimePickerViewIT
13:37:54.017 [ForkJoinPool-1-worker-2] INFO org.springframework.test.context.support.AnnotationConfigContextLoaderUtils -- Could not detect default configuration classes for test class [org.vaadin.addons.dramafinder.tests.it.TimePickerViewIT]: TimePickerViewIT does not declare any static, non-private, non-final, nested classes annotated with @Configuration.
13:37:54.018 [ForkJoinPool-1-worker-2] INFO org.springframework.test.context.support.AnnotationConfigContextLoaderUtils -- Could not detect default configuration classes for test class [org.vaadin.addons.dramafinder.tests.it.SpringPlaywrightIT]: SpringPlaywrightIT does not declare any static, non-private, non-final, nested classes annotated with @Configuration.
13:37:54.018 [ForkJoinPool-1-worker-2] INFO org.springframework.test.context.support.AnnotationConfigContextLoaderUtils -- Could not detect default configuration classes for test class [org.vaadin.addons.dramafinder.AbstractBasePlaywrightIT]: AbstractBasePlaywrightIT does not declare any static, non-private, non-final, nested classes annotated with @Configuration.
13:37:54.019 [ForkJoinPool-1-worker-1] INFO org.springframework.test.context.support.AnnotationConfigContextLoaderUtils -- Could not detect default configuration classes for test class [org.vaadin.addons.dramafinder.tests.it.SimpleExampleViewIT]: SimpleExampleViewIT does not declare any static, non-private, non-final, nested classes annotated with @Configuration.
13:37:54.020 [ForkJoinPool-1-worker-1] INFO org.springframework.test.context.support.AnnotationConfigContextLoaderUtils -- Could not detect default configuration classes for test class [org.vaadin.addons.dramafinder.tests.it.SpringPlaywrightIT]: SpringPlaywrightIT does not declare any static, non-private, non-final, nested classes annotated with @Configuration.
13:37:54.020 [ForkJoinPool-1-worker-1] INFO org.springframework.test.context.support.AnnotationConfigContextLoaderUtils -- Could not detect default configuration classes for test class [org.vaadin.addons.dramafinder.AbstractBasePlaywrightIT]: AbstractBasePlaywrightIT does not declare any static, non-private, non-final, nested classes annotated with @Configuration.
13:37:54.021 [ForkJoinPool-1-worker-1] INFO org.springframework.boot.test.context.SpringBootTestContextBootstrapper -- Found @SpringBootConfiguration org.vaadin.addons.dramafinder.tests.TestServer for test class org.vaadin.addons.dramafinder.tests.it.SimpleExampleViewIT
13:37:54.021 [ForkJoinPool-1-worker-2] INFO org.springframework.boot.test.context.SpringBootTestContextBootstrapper -- Found @SpringBootConfiguration org.vaadin.addons.dramafinder.tests.TestServer for test class org.vaadin.addons.dramafinder.tests.it.TimePickerViewIT
. ____ _ __ _ _
/\\ / ___'_ __ _ _(_)_ __ __ _ \ \ \ \
( ( )\___ | '_ | '_| | '_ \/ _` | \ \ \ \
\\/ ___)| |_)| | | | | || (_| | ) ) ) )
' |____| .__|_| |_|_| |_\__, | / / / /
=========|_|==============|___/=/_/_/_/
:: Spring Boot :: (v4.1.1)
2026-09-21T13:37:56.869Z INFO 230151 --- [Pool-1-worker-1] o.v.a.d.tests.it.SimpleExampleViewIT : Starting SimpleExampleViewIT using Java 25 with PID 230151 (started by ghrunner in /home/ghrunner/actions-runner/_work/vaadin-ecosystem-build/vaadin-ecosystem-build/work/dramafinder)
2026-09-21T13:37:56.871Z INFO 230151 --- [Pool-1-worker-1] o.v.a.d.tests.it.SimpleExampleViewIT : No active profile set, falling back to 1 default profile: "default"
2026-09-21T13:37:58.230Z INFO 230151 --- [Pool-1-worker-1] o.s.boot.tomcat.TomcatWebServer : Tomcat initialized with port 0 (http)
2026-09-21T13:37:58.267Z INFO 230151 --- [Pool-1-worker-1] o.apache.catalina.core.StandardService : Starting service [Tomcat]
2026-09-21T13:37:58.267Z INFO 230151 --- [Pool-1-worker-1] o.apache.catalina.core.StandardEngine : Starting Servlet engine: [Apache Tomcat/11.0.25]
2026-09-21T13:37:58.364Z INFO 230151 --- [Pool-1-worker-1] b.w.c.s.WebApplicationContextInitializer : Root WebApplicationContext: initialization completed in 1441 ms
2026-09-21T13:38:01.755Z INFO 230151 --- [Pool-1-worker-1] c.v.f.s.VaadinServletContextInitializer : Search for subclasses and classes with annotations took 2914 ms
2026-09-21T13:38:01.766Z WARN 230151 --- [Pool-1-worker-1] com.vaadin.experimental.FeatureFlags : Unsupported feature flag is present: com.vaadin.experimental.switchComponent
2026-09-21T13:38:01.766Z WARN 230151 --- [Pool-1-worker-1] com.vaadin.experimental.FeatureFlags : Unsupported feature flag is present: com.vaadin.experimental.breadcrumbsComponent
2026-09-21T13:38:01.958Z INFO 230151 --- [Pool-1-worker-1] c.v.b.d.startup.DevModeStartupListener : Starting dev-mode updaters in /home/ghrunner/actions-runner/_work/vaadin-ecosystem-build/vaadin-ecosystem-build/work/dramafinder folder.
2026-09-21T13:38:01.999Z WARN 230151 --- [Pool-1-worker-1] com.vaadin.experimental.FeatureFlags : Unsupported feature flag is present: com.vaadin.experimental.switchComponent
2026-09-21T13:38:01.999Z WARN 230151 --- [Pool-1-worker-1] com.vaadin.experimental.FeatureFlags : Unsupported feature flag is present: com.vaadin.experimental.breadcrumbsComponent
2026-09-21T13:38:02.069Z INFO 230151 --- [Pool-1-worker-1] c.v.f.s.f.s.FullDependenciesScanner : Visited 107 classes. Took 64 ms.
2026-09-21T13:38:02.075Z INFO 230151 --- [Pool-1-worker-1] c.v.f.s.frontend.BundleValidationUtil : Checking if a development mode bundle build is needed
2026-09-21T13:38:02.234Z INFO 230151 --- [Pool-1-worker-1] c.v.f.s.frontend.BundleValidationUtil : A development mode bundle build is not needed
2026-09-21T13:38:02.304Z INFO 230151 --- [in-dev-server-1] c.v.f.s.frontend.TaskCopyFrontendFiles : Copying frontend resources from jar files ...
2026-09-21T13:38:02.487Z INFO 230151 --- [in-dev-server-1] c.v.f.s.frontend.TaskCopyFrontendFiles : Visited 19 resources. Took 182 ms.
2026-09-21T13:38:03.829Z INFO 230151 --- [Pool-1-worker-1] org.atmosphere.cpr.AtmosphereFramework : Installed AtmosphereHandler com.vaadin.flow.server.communication.PushAtmosphereHandler mapped to context-path: /*
2026-09-21T13:38:03.830Z INFO 230151 --- [Pool-1-worker-1] org.atmosphere.cpr.AtmosphereFramework : Installed the following AtmosphereInterceptor mapped to AtmosphereHandler com.vaadin.flow.server.communication.PushAtmosphereHandler
2026-09-21T13:38:03.907Z INFO 230151 --- [Pool-1-worker-1] org.atmosphere.cpr.AtmosphereFramework : Atmosphere is using org.atmosphere.util.VoidAnnotationProcessor for processing annotation
2026-09-21T13:38:03.920Z INFO 230151 --- [Pool-1-worker-1] org.atmosphere.util.ForkJoinPool : Using ForkJoinPool java.util.concurrent.ForkJoinPool. Set the org.atmosphere.cpr.broadcaster.maxAsyncWriteThreads to -1 to fully use its power.
2026-09-21T13:38:03.930Z INFO 230151 --- [Pool-1-worker-1] org.atmosphere.cpr.AtmosphereFramework : Installed WebSocketProtocol org.atmosphere.websocket.protocol.SimpleHttpProtocol
2026-09-21T13:38:03.943Z INFO 230151 --- [Pool-1-worker-1] o.a.container.JSR356AsyncSupport : JSR 356 Mapping path /VAADIN/push
2026-09-21T13:38:03.981Z INFO 230151 --- [Pool-1-worker-1] org.atmosphere.cpr.AtmosphereFramework : Installing Default AtmosphereInterceptors
2026-09-21T13:38:03.981Z INFO 230151 --- [Pool-1-worker-1] org.atmosphere.cpr.AtmosphereFramework : org.atmosphere.interceptor.CorsInterceptor : CORS Interceptor Support
2026-09-21T13:38:03.981Z INFO 230151 --- [Pool-1-worker-1] org.atmosphere.cpr.AtmosphereFramework : org.atmosphere.interceptor.CacheHeadersInterceptor : Default Response's Headers Interceptor
2026-09-21T13:38:03.982Z INFO 230151 --- [Pool-1-worker-1] org.atmosphere.cpr.AtmosphereFramework : org.atmosphere.interceptor.PaddingAtmosphereInterceptor : Browser Padding Interceptor Support
2026-09-21T13:38:03.985Z INFO 230151 --- [Pool-1-worker-1] org.atmosphere.cpr.AtmosphereFramework : org.atmosphere.interceptor.AndroidAtmosphereInterceptor : Android Interceptor Support
2026-09-21T13:38:03.986Z INFO 230151 --- [Pool-1-worker-1] org.atmosphere.cpr.AtmosphereFramework : org.atmosphere.interceptor.HeartbeatInterceptor : Heartbeat Interceptor Support
2026-09-21T13:38:03.987Z INFO 230151 --- [Pool-1-worker-1] org.atmosphere.cpr.AtmosphereFramework : org.atmosphere.interceptor.SSEAtmosphereInterceptor : SSE Interceptor Support
2026-09-21T13:38:03.987Z INFO 230151 --- [Pool-1-worker-1] org.atmosphere.cpr.AtmosphereFramework : org.atmosphere.interceptor.JSONPAtmosphereInterceptor : JSONP Interceptor Support
2026-09-21T13:38:03.988Z INFO 230151 --- [Pool-1-worker-1] org.atmosphere.cpr.AtmosphereFramework : org.atmosphere.interceptor.JavaScriptProtocol : Atmosphere JavaScript Protocol
2026-09-21T13:38:03.991Z INFO 230151 --- [Pool-1-worker-1] org.atmosphere.cpr.AtmosphereFramework : org.atmosphere.interceptor.WebSocketMessageSuspendInterceptor : org.atmosphere.interceptor.WebSocketMessageSuspendInterceptor
2026-09-21T13:38:03.992Z INFO 230151 --- [Pool-1-worker-1] org.atmosphere.cpr.AtmosphereFramework : org.atmosphere.interceptor.OnDisconnectInterceptor : Browser disconnection detection
2026-09-21T13:38:03.992Z INFO 230151 --- [Pool-1-worker-1] org.atmosphere.cpr.AtmosphereFramework : org.atmosphere.interceptor.IdleResourceInterceptor : org.atmosphere.interceptor.IdleResourceInterceptor
2026-09-21T13:38:03.992Z INFO 230151 --- [Pool-1-worker-1] org.atmosphere.cpr.AtmosphereFramework : Set org.atmosphere.cpr.AtmosphereInterceptor.disableDefaults to disable them.
2026-09-21T13:38:03.993Z INFO 230151 --- [Pool-1-worker-1] org.atmosphere.cpr.AtmosphereFramework : Installed AtmosphereInterceptor CORS Interceptor Support with priority FIRST_BEFORE_DEFAULT
2026-09-21T13:38:04.009Z INFO 230151 --- [Pool-1-worker-1] org.atmosphere.cpr.AtmosphereFramework : Installed AtmosphereInterceptor Default Response's Headers Interceptor with priority AFTER_DEFAULT
2026-09-21T13:38:04.010Z INFO 230151 --- [Pool-1-worker-1] org.atmosphere.cpr.AtmosphereFramework : Installed AtmosphereInterceptor Browser Padding Interceptor Support with priority AFTER_DEFAULT
2026-09-21T13:38:04.010Z INFO 230151 --- [Pool-1-worker-1] org.atmosphere.cpr.AtmosphereFramework : Installed AtmosphereInterceptor Android Interceptor Support with priority AFTER_DEFAULT
2026-09-21T13:38:04.010Z INFO 230151 --- [Pool-1-worker-1] o.a.interceptor.HeartbeatInterceptor : HeartbeatInterceptor configured with padding value 'X', client frequency 0 seconds and server frequency 60 seconds
2026-09-21T13:38:04.011Z INFO 230151 --- [Pool-1-worker-1] org.atmosphere.cpr.AtmosphereFramework : Installed AtmosphereInterceptor Heartbeat Interceptor Support with priority AFTER_DEFAULT
2026-09-21T13:38:04.011Z INFO 230151 --- [Pool-1-worker-1] org.atmosphere.cpr.AtmosphereFramework : Installed AtmosphereInterceptor SSE Interceptor Support with priority AFTER_DEFAULT
2026-09-21T13:38:04.019Z INFO 230151 --- [Pool-1-worker-1] org.atmosphere.cpr.AtmosphereFramework : Installed AtmosphereInterceptor JSONP Interceptor Support with priority AFTER_DEFAULT
2026-09-21T13:38:04.019Z INFO 230151 --- [Pool-1-worker-1] org.atmosphere.cpr.AtmosphereFramework : Installed AtmosphereInterceptor Atmosphere JavaScript Protocol with priority AFTER_DEFAULT
2026-09-21T13:38:04.019Z INFO 230151 --- [Pool-1-worker-1] org.atmosphere.cpr.AtmosphereFramework : Installed AtmosphereInterceptor org.atmosphere.interceptor.WebSocketMessageSuspendInterceptor with priority AFTER_DEFAULT
2026-09-21T13:38:04.020Z INFO 230151 --- [Pool-1-worker-1] org.atmosphere.cpr.AtmosphereFramework : Installed AtmosphereInterceptor Browser disconnection detection with priority AFTER_DEFAULT
2026-09-21T13:38:04.020Z INFO 230151 --- [Pool-1-worker-1] org.atmosphere.cpr.AtmosphereFramework : Installed AtmosphereInterceptor org.atmosphere.interceptor.IdleResourceInterceptor with priority BEFORE_DEFAULT
2026-09-21T13:38:04.021Z INFO 230151 --- [Pool-1-worker-1] org.atmosphere.cpr.AtmosphereFramework : Using EndpointMapper class org.atmosphere.util.DefaultEndpointMapper
2026-09-21T13:38:04.021Z INFO 230151 --- [Pool-1-worker-1] org.atmosphere.cpr.AtmosphereFramework : Using BroadcasterCache: org.atmosphere.cache.UUIDBroadcasterCache
2026-09-21T13:38:04.021Z INFO 230151 --- [Pool-1-worker-1] org.atmosphere.cpr.AtmosphereFramework : Default Broadcaster Class: org.atmosphere.cpr.DefaultBroadcaster
2026-09-21T13:38:04.021Z INFO 230151 --- [Pool-1-worker-1] org.atmosphere.cpr.AtmosphereFramework : Broadcaster Shared List Resources: false
2026-09-21T13:38:04.021Z INFO 230151 --- [Pool-1-worker-1] org.atmosphere.cpr.AtmosphereFramework : Broadcaster Polling Wait Time 100
2026-09-21T13:38:04.021Z INFO 230151 --- [Pool-1-worker-1] org.atmosphere.cpr.AtmosphereFramework : Shared ExecutorService supported: true
2026-09-21T13:38:04.021Z INFO 230151 --- [Pool-1-worker-1] org.atmosphere.cpr.AtmosphereFramework : Messaging ExecutorService Pool Size unavailable - Not instance of ThreadPoolExecutor
2026-09-21T13:38:04.021Z INFO 230151 --- [Pool-1-worker-1] org.atmosphere.cpr.AtmosphereFramework : Async I/O Thread Pool Size: 200
2026-09-21T13:38:04.021Z INFO 230151 --- [Pool-1-worker-1] org.atmosphere.cpr.AtmosphereFramework : Using BroadcasterFactory: org.atmosphere.cpr.DefaultBroadcasterFactory
2026-09-21T13:38:04.022Z INFO 230151 --- [Pool-1-worker-1] org.atmosphere.cpr.AtmosphereFramework : Using AtmosphereResurceFactory: org.atmosphere.cpr.DefaultAtmosphereResourceFactory
2026-09-21T13:38:04.022Z INFO 230151 --- [Pool-1-worker-1] org.atmosphere.cpr.AtmosphereFramework : Using WebSocketProcessor: org.atmosphere.websocket.DefaultWebSocketProcessor
2026-09-21T13:38:04.029Z INFO 230151 --- [Pool-1-worker-1] org.atmosphere.cpr.AtmosphereFramework : Invoke AtmosphereInterceptor on WebSocket message true
2026-09-21T13:38:04.029Z INFO 230151 --- [Pool-1-worker-1] org.atmosphere.cpr.AtmosphereFramework : HttpSession supported: true
2026-09-21T13:38:04.029Z INFO 230151 --- [Pool-1-worker-1] org.atmosphere.cpr.AtmosphereFramework : Atmosphere is using DefaultAtmosphereObjectFactory for dependency injection and object creation
2026-09-21T13:38:04.030Z INFO 230151 --- [Pool-1-worker-1] org.atmosphere.cpr.AtmosphereFramework : Atmosphere is using async support: org.atmosphere.container.JSR356AsyncSupport running under container: Apache Tomcat/11.0.25 using jakarta.servlet/3.0 and jsr356/WebSocket API
2026-09-21T13:38:04.033Z INFO 230151 --- [Pool-1-worker-1] org.atmosphere.cpr.AtmosphereFramework : Atmosphere Framework 3.0.5.slf4jvaadin1 started.
2026-09-21T13:38:04.047Z INFO 230151 --- [Pool-1-worker-1] org.atmosphere.cpr.AtmosphereFramework : Installed AtmosphereInterceptor Track Message Size Interceptor using | with priority BEFORE_DEFAULT
2026-09-21T13:38:04.192Z INFO 230151 --- [Pool-1-worker-1] c.v.f.s.DefaultDeploymentConfiguration :
Vaadin is running in DEVELOPMENT mode - do not use for production deployments.
2026-09-21T13:38:04.276Z INFO 230151 --- [Pool-1-worker-1] c.vaadin.copilot.CopilotIndexHtmlLoader : Copilot is disabled
2026-09-21T13:38:04.334Z INFO 230151 --- [Pool-1-worker-1] o.s.boot.tomcat.TomcatWebServer : Tomcat started on port 40999 (http) with context path '/'
2026-09-21T13:38:04.345Z INFO 230151 --- [Pool-1-worker-1] o.v.a.d.tests.it.SimpleExampleViewIT : Started SimpleExampleViewIT in 7.859 seconds (process running for 13.149)
2026-09-21T13:38:04.362Z INFO 230151 --- [Pool-1-worker-1] c.v.b.d.DevModeHandlerManagerImpl : Application running at http://localhost:0/
Mockito is currently self-attaching to enable the inline-mock-maker. This will no longer work in future releases of the JDK. Please add Mockito as an agent to your build as described in Mockito's documentation: https://javadoc.io/doc/org.mockito/mockito-core/latest/org.mockito/org/mockito/Mockito.html#0.3
[INFO] Running org.vaadin.addons.dramafinder.tests.it.TabsViewIT
2026-09-21T13:38:04.450Z INFO 230151 --- [Pool-1-worker-3] t.c.s.AnnotationConfigContextLoaderUtils : Could not detect default configuration classes for test class [org.vaadin.addons.dramafinder.tests.it.TabsViewIT]: TabsViewIT does not declare any static, non-private, non-final, nested classes annotated with @Configuration.
2026-09-21T13:38:04.454Z INFO 230151 --- [Pool-1-worker-3] .b.t.c.SpringBootTestContextBootstrapper : Found @SpringBootConfiguration org.vaadin.addons.dramafinder.tests.TestServer for test class org.vaadin.addons.dramafinder.tests.it.TabsViewIT
2026-09-21T13:38:04.455Z INFO 230151 --- [Pool-1-worker-3] t.c.s.AnnotationConfigContextLoaderUtils : Could not detect default configuration classes for test class [org.vaadin.addons.dramafinder.tests.it.TabsViewIT]: TabsViewIT does not declare any static, non-private, non-final, nested classes annotated with @Configuration.
2026-09-21T13:38:04.456Z INFO 230151 --- [Pool-1-worker-3] t.c.s.AnnotationConfigContextLoaderUtils : Could not detect default configuration classes for test class [org.vaadin.addons.dramafinder.tests.it.SpringPlaywrightIT]: SpringPlaywrightIT does not declare any static, non-private, non-final, nested classes annotated with @Configuration.
2026-09-21T13:38:04.456Z INFO 230151 --- [Pool-1-worker-3] t.c.s.AnnotationConfigContextLoaderUtils : Could not detect default configuration classes for test class [org.vaadin.addons.dramafinder.AbstractBasePlaywrightIT]: AbstractBasePlaywrightIT does not declare any static, non-private, non-final, nested classes annotated with @Configuration.
2026-09-21T13:38:04.458Z INFO 230151 --- [Pool-1-worker-3] .b.t.c.SpringBootTestContextBootstrapper : Found @SpringBootConfiguration org.vaadin.addons.dramafinder.tests.TestServer for test class org.vaadin.addons.dramafinder.tests.it.TabsViewIT
OpenJDK 64-Bit Server VM warning: Sharing is only supported for boot loader classes because bootstrap classpath has been appended
WARNING: A Java agent has been loaded dynamically (/home/ghrunner/.m2/repository/net/bytebuddy/byte-buddy-agent/1.18.11/byte-buddy-agent-1.18.11.jar)
WARNING: If a serviceability tool is in use, please run with -XX:+EnableDynamicAgentLoading to hide this warning
WARNING: If a serviceability tool is not in use, please run with -Djdk.instrument.traceUsage for more information
WARNING: Dynamic loading of agents will be disallowed by default in a future release
2026-09-21T13:38:06.009Z INFO 230151 --- [o-auto-1-exec-3] o.a.c.c.C.[Tomcat].[localhost].[/] : Initializing Spring DispatcherServlet 'dispatcherServlet'
2026-09-21T13:38:06.009Z INFO 230151 --- [o-auto-1-exec-3] o.s.web.servlet.DispatcherServlet : Initializing Servlet 'dispatcherServlet'
2026-09-21T13:38:06.011Z INFO 230151 --- [o-auto-1-exec-3] o.s.web.servlet.DispatcherServlet : Completed initialization in 2 ms
[INFO] Tests run: 1, Failures: 0, Errors: 0, Skipped: 0, Time elapsed: 16.54 s -- in org.vaadin.addons.dramafinder.tests.it.SimpleExampleViewIT
[INFO] Running org.vaadin.addons.dramafinder.tests.it.TreeGridExpandCollapseViewIT
2026-09-21T13:38:09.487Z INFO 230151 --- [Pool-1-worker-1] t.c.s.AnnotationConfigContextLoaderUtils : Could not detect default configuration classes for test class [org.vaadin.addons.dramafinder.tests.it.TreeGridExpandCollapseViewIT]: TreeGridExpandCollapseViewIT does not declare any static, non-private, non-final, nested classes annotated with @Configuration.
2026-09-21T13:38:09.495Z INFO 230151 --- [Pool-1-worker-1] .b.t.c.SpringBootTestContextBootstrapper : Found @SpringBootConfiguration org.vaadin.addons.dramafinder.tests.TestServer for test class org.vaadin.addons.dramafinder.tests.it.TreeGridExpandCollapseViewIT
2026-09-21T13:38:09.497Z INFO 230151 --- [Pool-1-worker-1] t.c.s.AnnotationConfigContextLoaderUtils : Could not detect default configuration classes for test class [org.vaadin.addons.dramafinder.tests.it.TreeGridExpandCollapseViewIT]: TreeGridExpandCollapseViewIT does not declare any static, non-private, non-final, nested classes annotated with @Configuration.
2026-09-21T13:38:09.508Z INFO 230151 --- [Pool-1-worker-1] t.c.s.AnnotationConfigContextLoaderUtils : Could not detect default configuration classes for test class [org.vaadin.addons.dramafinder.tests.it.SpringPlaywrightIT]: SpringPlaywrightIT does not declare any static, non-private, non-final, nested classes annotated with @Configuration.
2026-09-21T13:38:09.509Z INFO 230151 --- [Pool-1-worker-1] t.c.s.AnnotationConfigContextLoaderUtils : Could not detect default configuration classes for test class [org.vaadin.addons.dramafinder.AbstractBasePlaywrightIT]: AbstractBasePlaywrightIT does not declare any static, non-private, non-final, nested classes annotated with @Configuration.
2026-09-21T13:38:09.539Z INFO 230151 --- [Pool-1-worker-1] .b.t.c.SpringBootTestContextBootstrapper : Found @SpringBootConfiguration org.vaadin.addons.dramafinder.tests.TestServer for test class org.vaadin.addons.dramafinder.tests.it.TreeGridExpandCollapseViewIT
[INFO] Tests run: 6, Failures: 0, Errors: 0, Skipped: 0, Time elapsed: 16.53 s -- in org.vaadin.addons.dramafinder.tests.it.TabsViewIT
[INFO] Running org.vaadin.addons.dramafinder.tests.it.GridFooterViewIT
2026-09-21T13:38:20.987Z INFO 230151 --- [Pool-1-worker-3] t.c.s.AnnotationConfigContextLoaderUtils : Could not detect default configuration classes for test class [org.vaadin.addons.dramafinder.tests.it.GridFooterViewIT]: GridFooterViewIT does not declare any static, non-private, non-final, nested classes annotated with @Configuration.
2026-09-21T13:38:20.994Z INFO 230151 --- [Pool-1-worker-3] .b.t.c.SpringBootTestContextBootstrapper : Found @SpringBootConfiguration org.vaadin.addons.dramafinder.tests.TestServer for test class org.vaadin.addons.dramafinder.tests.it.GridFooterViewIT
2026-09-21T13:38:21.004Z INFO 230151 --- [Pool-1-worker-3] t.c.s.AnnotationConfigContextLoaderUtils : Could not detect default configuration classes for test class [org.vaadin.addons.dramafinder.tests.it.GridFooterViewIT]: GridFooterViewIT does not declare any static, non-private, non-final, nested classes annotated with @Configuration.
2026-09-21T13:38:21.004Z INFO 230151 --- [Pool-1-worker-3] t.c.s.AnnotationConfigContextLoaderUtils : Could not detect default configuration classes for test class [org.vaadin.addons.dramafinder.tests.it.SpringPlaywrightIT]: SpringPlaywrightIT does not declare any static, non-private, non-final, nested classes annotated with @Configuration.
2026-09-21T13:38:21.005Z INFO 230151 --- [Pool-1-worker-3] t.c.s.AnnotationConfigContextLoaderUtils : Could not detect default configuration classes for test class [org.vaadin.addons.dramafinder.AbstractBasePlaywrightIT]: AbstractBasePlaywrightIT does not declare any static, non-private, non-final, nested classes annotated with @Configuration.
2026-09-21T13:38:21.009Z INFO 230151 --- [Pool-1-worker-3] .b.t.c.SpringBootTestContextBootstrapper : Found @SpringBootConfiguration org.vaadin.addons.dramafinder.tests.TestServer for test class org.vaadin.addons.dramafinder.tests.it.GridFooterViewIT
[INFO] Tests run: 9, Failures: 0, Errors: 0, Skipped: 0, Time elapsed: 32.44 s -- in org.vaadin.addons.dramafinder.tests.it.TimePickerViewIT
[INFO] Running org.vaadin.addons.dramafinder.tests.it.MultiSelectComboBoxViewIT
2026-09-21T13:38:25.375Z INFO 230151 --- [Pool-1-worker-2] t.c.s.AnnotationConfigContextLoaderUtils : Could not detect default configuration classes for test class [org.vaadin.addons.dramafinder.tests.it.MultiSelectComboBoxViewIT]: MultiSelectComboBoxViewIT does not declare any static, non-private, non-final, nested classes annotated with @Configuration.
2026-09-21T13:38:25.377Z INFO 230151 --- [Pool-1-worker-2] .b.t.c.SpringBootTestContextBootstrapper : Found @SpringBootConfiguration org.vaadin.addons.dramafinder.tests.TestServer for test class org.vaadin.addons.dramafinder.tests.it.MultiSelectComboBoxViewIT
2026-09-21T13:38:25.378Z INFO 230151 --- [Pool-1-worker-2] t.c.s.AnnotationConfigContextLoaderUtils : Could not detect default configuration classes for test class [org.vaadin.addons.dramafinder.tests.it.MultiSelectComboBoxViewIT]: MultiSelectComboBoxViewIT does not declare any static, non-private, non-final, nested classes annotated with @Configuration.
2026-09-21T13:38:25.382Z INFO 230151 --- [Pool-1-worker-2] t.c.s.AnnotationConfigContextLoaderUtils : Could not detect default configuration classes for test class [org.vaadin.addons.dramafinder.tests.it.SpringPlaywrightIT]: SpringPlaywrightIT does not declare any static, non-private, non-final, nested classes annotated with @Configuration.
2026-09-21T13:38:25.382Z INFO 230151 --- [Pool-1-worker-2] t.c.s.AnnotationConfigContextLoaderUtils : Could not detect default configuration classes for test class [org.vaadin.addons.dramafinder.AbstractBasePlaywrightIT]: AbstractBasePlaywrightIT does not declare any static, non-private, non-final, nested classes annotated with @Configuration.
2026-09-21T13:38:25.384Z INFO 230151 --- [Pool-1-worker-2] .b.t.c.SpringBootTestContextBootstrapper : Found @SpringBootConfiguration org.vaadin.addons.dramafinder.tests.TestServer for test class org.vaadin.addons.dramafinder.tests.it.MultiSelectComboBoxViewIT
[INFO] Tests run: 7, Failures: 0, Errors: 0, Skipped: 0, Time elapsed: 13.85 s -- in org.vaadin.addons.dramafinder.tests.it.GridFooterViewIT
[INFO] Running org.vaadin.addons.dramafinder.tests.it.LoginFormViewIT
2026-09-21T13:38:34.834Z INFO 230151 --- [Pool-1-worker-3] t.c.s.AnnotationConfigContextLoaderUtils : Could not detect default configuration classes for test class [org.vaadin.addons.dramafinder.tests.it.LoginFormViewIT]: LoginFormViewIT does not declare any static, non-private, non-final, nested classes annotated with @Configuration.
2026-09-21T13:38:34.843Z INFO 230151 --- [Pool-1-worker-3] .b.t.c.SpringBootTestContextBootstrapper : Found @SpringBootConfiguration org.vaadin.addons.dramafinder.tests.TestServer for test class org.vaadin.addons.dramafinder.tests.it.LoginFormViewIT
2026-09-21T13:38:34.844Z INFO 230151 --- [Pool-1-worker-3] t.c.s.AnnotationConfigContextLoaderUtils : Could not detect default configuration classes for test class [org.vaadin.addons.dramafinder.tests.it.LoginFormViewIT]: LoginFormViewIT does not declare any static, non-private, non-final, nested classes annotated with @Configuration.
2026-09-21T13:38:34.845Z INFO 230151 --- [Pool-1-worker-3] t.c.s.AnnotationConfigContextLoaderUtils : Could not detect default configuration classes for test class [org.vaadin.addons.dramafinder.tests.it.SpringPlaywrightIT]: SpringPlaywrightIT does not declare any static, non-private, non-final, nested classes annotated with @Configuration.
2026-09-21T13:38:34.845Z INFO 230151 --- [Pool-1-worker-3] t.c.s.AnnotationConfigContextLoaderUtils : Could not detect default configuration classes for test class [org.vaadin.addons.dramafinder.AbstractBasePlaywrightIT]: AbstractBasePlaywrightIT does not declare any static, non-private, non-final, nested classes annotated with @Configuration.
2026-09-21T13:38:34.845Z INFO 230151 --- [Pool-1-worker-3] .b.t.c.SpringBootTestContextBootstrapper : Found @SpringBootConfiguration org.vaadin.addons.dramafinder.tests.TestServer for test class org.vaadin.addons.dramafinder.tests.it.LoginFormViewIT
[INFO] Tests run: 7, Failures: 0, Errors: 0, Skipped: 0, Time elapsed: 14.52 s -- in org.vaadin.addons.dramafinder.tests.it.LoginFormViewIT
[INFO] Running org.vaadin.addons.dramafinder.tests.it.ListBoxViewIT
2026-09-21T13:38:49.362Z INFO 230151 --- [Pool-1-worker-3] t.c.s.AnnotationConfigContextLoaderUtils : Could not detect default configuration classes for test class [org.vaadin.addons.dramafinder.tests.it.ListBoxViewIT]: ListBoxViewIT does not declare any static, non-private, non-final, nested classes annotated with @Configuration.
2026-09-21T13:38:49.372Z INFO 230151 --- [Pool-1-worker-3] .b.t.c.SpringBootTestContextBootstrapper : Found @SpringBootConfiguration org.vaadin.addons.dramafinder.tests.TestServer for test class org.vaadin.addons.dramafinder.tests.it.ListBoxViewIT
2026-09-21T13:38:49.382Z INFO 230151 --- [Pool-1-worker-3] t.c.s.AnnotationConfigContextLoaderUtils : Could not detect default configuration classes for test class [org.vaadin.addons.dramafinder.tests.it.ListBoxViewIT]: ListBoxViewIT does not declare any static, non-private, non-final, nested classes annotated with @Configuration.
2026-09-21T13:38:49.382Z INFO 230151 --- [Pool-1-worker-3] t.c.s.AnnotationConfigContextLoaderUtils : Could not detect default configuration classes for test class [org.vaadin.addons.dramafinder.tests.it.SpringPlaywrightIT]: SpringPlaywrightIT does not declare any static, non-private, non-final, nested classes annotated with @Configuration.
2026-09-21T13:38:49.383Z INFO 230151 --- [Pool-1-worker-3] t.c.s.AnnotationConfigContextLoaderUtils : Could not detect default configuration classes for test class [org.vaadin.addons.dramafinder.AbstractBasePlaywrightIT]: AbstractBasePlaywrightIT does not declare any static, non-private, non-final, nested classes annotated with @Configuration.
2026-09-21T13:38:49.384Z INFO 230151 --- [Pool-1-worker-3] .b.t.c.SpringBootTestContextBootstrapper : Found @SpringBootConfiguration org.vaadin.addons.dramafinder.tests.TestServer for test class org.vaadin.addons.dramafinder.tests.it.ListBoxViewIT
[INFO] Tests run: 16, Failures: 0, Errors: 0, Skipped: 0, Time elapsed: 53.14 s -- in org.vaadin.addons.dramafinder.tests.it.TreeGridExpandCollapseViewIT
[INFO] Running org.vaadin.addons.dramafinder.tests.it.SwitchViewIT
2026-09-21T13:39:02.632Z INFO 230151 --- [Pool-1-worker-1] t.c.s.AnnotationConfigContextLoaderUtils : Could not detect default configuration classes for test class [org.vaadin.addons.dramafinder.tests.it.SwitchViewIT]: SwitchViewIT does not declare any static, non-private, non-final, nested classes annotated with @Configuration.
2026-09-21T13:39:02.637Z INFO 230151 --- [Pool-1-worker-1] .b.t.c.SpringBootTestContextBootstrapper : Found @SpringBootConfiguration org.vaadin.addons.dramafinder.tests.TestServer for test class org.vaadin.addons.dramafinder.tests.it.SwitchViewIT
2026-09-21T13:39:02.643Z INFO 230151 --- [Pool-1-worker-1] t.c.s.AnnotationConfigContextLoaderUtils : Could not detect default configuration classes for test class [org.vaadin.addons.dramafinder.tests.it.SwitchViewIT]: SwitchViewIT does not declare any static, non-private, non-final, nested classes annotated with @Configuration.
2026-09-21T13:39:02.643Z INFO 230151 --- [Pool-1-worker-1] t.c.s.AnnotationConfigContextLoaderUtils : Could not detect default configuration classes for test class [org.vaadin.addons.dramafinder.tests.it.SpringPlaywrightIT]: SpringPlaywrightIT does not declare any static, non-private, non-final, nested classes annotated with @Configuration.
2026-09-21T13:39:02.644Z INFO 230151 --- [Pool-1-worker-1] t.c.s.AnnotationConfigContextLoaderUtils : Could not detect default configuration classes for test class [org.vaadin.addons.dramafinder.AbstractBasePlaywrightIT]: AbstractBasePlaywrightIT does not declare any static, non-private, non-final, nested classes annotated with @Configuration.
2026-09-21T13:39:02.645Z INFO 230151 --- [Pool-1-worker-1] .b.t.c.SpringBootTestContextBootstrapper : Found @SpringBootConfiguration org.vaadin.addons.dramafinder.tests.TestServer for test class org.vaadin.addons.dramafinder.tests.it.SwitchViewIT
[INFO] Tests run: 9, Failures: 0, Errors: 0, Skipped: 0, Time elapsed: 16.66 s -- in org.vaadin.addons.dramafinder.tests.it.ListBoxViewIT
[INFO] Running org.vaadin.addons.dramafinder.tests.it.GridComponentRendererViewIT
2026-09-21T13:39:06.024Z INFO 230151 --- [Pool-1-worker-3] t.c.s.AnnotationConfigContextLoaderUtils : Could not detect default configuration classes for test class [org.vaadin.addons.dramafinder.tests.it.GridComponentRendererViewIT]: GridComponentRendererViewIT does not declare any static, non-private, non-final, nested classes annotated with @Configuration.
2026-09-21T13:39:06.028Z INFO 230151 --- [Pool-1-worker-3] .b.t.c.SpringBootTestContextBootstrapper : Found @SpringBootConfiguration org.vaadin.addons.dramafinder.tests.TestServer for test class org.vaadin.addons.dramafinder.tests.it.GridComponentRendererViewIT
2026-09-21T13:39:06.029Z INFO 230151 --- [Pool-1-worker-3] t.c.s.AnnotationConfigContextLoaderUtils : Could not detect default configuration classes for test class [org.vaadin.addons.dramafinder.tests.it.GridComponentRendererViewIT]: GridComponentRendererViewIT does not declare any static, non-private, non-final, nested classes annotated with @Configuration.
2026-09-21T13:39:06.032Z INFO 230151 --- [Pool-1-worker-3] t.c.s.AnnotationConfigContextLoaderUtils : Could not detect default configuration classes for test class [org.vaadin.addons.dramafinder.tests.it.SpringPlaywrightIT]: SpringPlaywrightIT does not declare any static, non-private, non-final, nested classes annotated with @Configuration.
2026-09-21T13:39:06.033Z INFO 230151 --- [Pool-1-worker-3] t.c.s.AnnotationConfigContextLoaderUtils : Could not detect default configuration classes for test class [org.vaadin.addons.dramafinder.AbstractBasePlaywrightIT]: AbstractBasePlaywrightIT does not declare any static, non-private, non-final, nested classes annotated with @Configuration.
2026-09-21T13:39:06.034Z INFO 230151 --- [Pool-1-worker-3] .b.t.c.SpringBootTestContextBootstrapper : Found @SpringBootConfiguration org.vaadin.addons.dramafinder.tests.TestServer for test class org.vaadin.addons.dramafinder.tests.it.GridComponentRendererViewIT
[INFO] Tests run: 10, Failures: 0, Errors: 0, Skipped: 0, Time elapsed: 17.68 s -- in org.vaadin.addons.dramafinder.tests.it.SwitchViewIT
[INFO] Running org.vaadin.addons.dramafinder.tests.it.TabSheetViewIT
2026-09-21T13:39:20.316Z INFO 230151 --- [Pool-1-worker-1] t.c.s.AnnotationConfigContextLoaderUtils : Could not detect default configuration classes for test class [org.vaadin.addons.dramafinder.tests.it.TabSheetViewIT]: TabSheetViewIT does not declare any static, non-private, non-final, nested classes annotated with @Configuration.
2026-09-21T13:39:20.326Z INFO 230151 --- [Pool-1-worker-1] .b.t.c.SpringBootTestContextBootstrapper : Found @SpringBootConfiguration org.vaadin.addons.dramafinder.tests.TestServer for test class org.vaadin.addons.dramafinder.tests.it.TabSheetViewIT
2026-09-21T13:39:20.332Z INFO 230151 --- [Pool-1-worker-1] t.c.s.AnnotationConfigContextLoaderUtils : Could not detect default configuration classes for test class [org.vaadin.addons.dramafinder.tests.it.TabSheetViewIT]: TabSheetViewIT does not declare any static, non-private, non-final, nested classes annotated with @Configuration.
2026-09-21T13:39:20.332Z INFO 230151 --- [Pool-1-worker-1] t.c.s.AnnotationConfigContextLoaderUtils : Could not detect default configuration classes for test class [org.vaadin.addons.dramafinder.tests.it.SpringPlaywrightIT]: SpringPlaywrightIT does not declare any static, non-private, non-final, nested classes annotated with @Configuration.
2026-09-21T13:39:20.333Z INFO 230151 --- [Pool-1-worker-1] t.c.s.AnnotationConfigContextLoaderUtils : Could not detect default configuration classes for test class [org.vaadin.addons.dramafinder.AbstractBasePlaywrightIT]: AbstractBasePlaywrightIT does not declare any static, non-private, non-final, nested classes annotated with @Configuration.
2026-09-21T13:39:20.344Z INFO 230151 --- [Pool-1-worker-1] .b.t.c.SpringBootTestContextBootstrapper : Found @SpringBootConfiguration org.vaadin.addons.dramafinder.tests.TestServer for test class org.vaadin.addons.dramafinder.tests.it.TabSheetViewIT
[INFO] Tests run: 7, Failures: 0, Errors: 0, Skipped: 0, Time elapsed: 15.57 s -- in org.vaadin.addons.dramafinder.tests.it.GridComponentRendererViewIT
[INFO] Running org.vaadin.addons.dramafinder.tests.it.TooltipViewIT
2026-09-21T13:39:21.606Z INFO 230151 --- [Pool-1-worker-3] t.c.s.AnnotationConfigContextLoaderUtils : Could not detect default configuration classes for test class [org.vaadin.addons.dramafinder.tests.it.TooltipViewIT]: TooltipViewIT does not declare any static, non-private, non-final, nested classes annotated with @Configuration.
2026-09-21T13:39:21.607Z INFO 230151 --- [Pool-1-worker-3] .b.t.c.SpringBootTestContextBootstrapper : Found @SpringBootConfiguration org.vaadin.addons.dramafinder.tests.TestServer for test class org.vaadin.addons.dramafinder.tests.it.TooltipViewIT
2026-09-21T13:39:21.608Z INFO 230151 --- [Pool-1-worker-3] t.c.s.AnnotationConfigContextLoaderUtils : Could not detect default configuration classes for test class [org.vaadin.addons.dramafinder.tests.it.TooltipViewIT]: TooltipViewIT does not declare any static, non-private, non-final, nested classes annotated with @Configuration.
2026-09-21T13:39:21.623Z INFO 230151 --- [Pool-1-worker-3] t.c.s.AnnotationConfigContextLoaderUtils : Could not detect default configuration classes for test class [org.vaadin.addons.dramafinder.tests.it.SpringPlaywrightIT]: SpringPlaywrightIT does not declare any static, non-private, non-final, nested classes annotated with @Configuration.
2026-09-21T13:39:21.624Z INFO 230151 --- [Pool-1-worker-3] t.c.s.AnnotationConfigContextLoaderUtils : Could not detect default configuration classes for test class [org.vaadin.addons.dramafinder.AbstractBasePlaywrightIT]: AbstractBasePlaywrightIT does not declare any static, non-private, non-final, nested classes annotated with @Configuration.
2026-09-21T13:39:21.625Z INFO 230151 --- [Pool-1-worker-3] .b.t.c.SpringBootTestContextBootstrapper : Found @SpringBootConfiguration org.vaadin.addons.dramafinder.tests.TestServer for test class org.vaadin.addons.dramafinder.tests.it.TooltipViewIT
[INFO] Tests run: 1, Failures: 0, Errors: 0, Skipped: 0, Time elapsed: 2.988 s -- in org.vaadin.addons.dramafinder.tests.it.TabSheetViewIT
[INFO] Running org.vaadin.addons.dramafinder.tests.it.IntegerFieldGetByLabelIT
2026-09-21T13:39:23.301Z INFO 230151 --- [Pool-1-worker-1] t.c.s.AnnotationConfigContextLoaderUtils : Could not detect default configuration classes for test class [org.vaadin.addons.dramafinder.tests.it.IntegerFieldGetByLabelIT]: IntegerFieldGetByLabelIT does not declare any static, non-private, non-final, nested classes annotated with @Configuration.
2026-09-21T13:39:23.313Z INFO 230151 --- [Pool-1-worker-1] .b.t.c.SpringBootTestContextBootstrapper : Found @SpringBootConfiguration org.vaadin.addons.dramafinder.tests.TestServer for test class org.vaadin.addons.dramafinder.tests.it.IntegerFieldGetByLabelIT
2026-09-21T13:39:23.314Z INFO 230151 --- [Pool-1-worker-1] t.c.s.AnnotationConfigContextLoaderUtils : Could not detect default configuration classes for test class [org.vaadin.addons.dramafinder.tests.it.IntegerFieldGetByLabelIT]: IntegerFieldGetByLabelIT does not declare any static, non-private, non-final, nested classes annotated with @Configuration.
2026-09-21T13:39:23.314Z INFO 230151 --- [Pool-1-worker-1] t.c.s.AnnotationConfigContextLoaderUtils : Could not detect default configuration classes for test class [org.vaadin.addons.dramafinder.tests.it.SpringPlaywrightIT]: SpringPlaywrightIT does not declare any static, non-private, non-final, nested classes annotated with @Configuration.
2026-09-21T13:39:23.314Z INFO 230151 --- [Pool-1-worker-1] t.c.s.AnnotationConfigContextLoaderUtils : Could not detect default configuration classes for test class [org.vaadin.addons.dramafinder.AbstractBasePlaywrightIT]: AbstractBasePlaywrightIT does not declare any static, non-private, non-final, nested classes annotated with @Configuration.
2026-09-21T13:39:23.315Z INFO 230151 --- [Pool-1-worker-1] .b.t.c.SpringBootTestContextBootstrapper : Found @SpringBootConfiguration org.vaadin.addons.dramafinder.tests.TestServer for test class org.vaadin.addons.dramafinder.tests.it.IntegerFieldGetByLabelIT
[INFO] Tests run: 3, Failures: 0, Errors: 0, Skipped: 0, Time elapsed: 5.750 s -- in org.vaadin.addons.dramafinder.tests.it.IntegerFieldGetByLabelIT
[INFO] Running org.vaadin.addons.dramafinder.tests.it.SplitLayoutViewIT
2026-09-21T13:39:29.057Z INFO 230151 --- [Pool-1-worker-1] t.c.s.AnnotationConfigContextLoaderUtils : Could not detect default configuration classes for test class [org.vaadin.addons.dramafinder.tests.it.SplitLayoutViewIT]: SplitLayoutViewIT does not declare any static, non-private, non-final, nested classes annotated with @Configuration.
2026-09-21T13:39:29.058Z INFO 230151 --- [Pool-1-worker-1] .b.t.c.SpringBootTestContextBootstrapper : Found @SpringBootConfiguration org.vaadin.addons.dramafinder.tests.TestServer for test class org.vaadin.addons.dramafinder.tests.it.SplitLayoutViewIT
2026-09-21T13:39:29.062Z INFO 230151 --- [Pool-1-worker-1] t.c.s.AnnotationConfigContextLoaderUtils : Could not detect default configuration classes for test class [org.vaadin.addons.dramafinder.tests.it.SplitLayoutViewIT]: SplitLayoutViewIT does not declare any static, non-private, non-final, nested classes annotated with @Configuration.
2026-09-21T13:39:29.062Z INFO 230151 --- [Pool-1-worker-1] t.c.s.AnnotationConfigContextLoaderUtils : Could not detect default configuration classes for test class [org.vaadin.addons.dramafinder.tests.it.SpringPlaywrightIT]: SpringPlaywrightIT does not declare any static, non-private, non-final, nested classes annotated with @Configuration.
2026-09-21T13:39:29.063Z INFO 230151 --- [Pool-1-worker-1] t.c.s.AnnotationConfigContextLoaderUtils : Could not detect default configuration classes for test class [org.vaadin.addons.dramafinder.AbstractBasePlaywrightIT]: AbstractBasePlaywrightIT does not declare any static, non-private, non-final, nested classes annotated with @Configuration.
2026-09-21T13:39:29.067Z INFO 230151 --- [Pool-1-worker-1] .b.t.c.SpringBootTestContextBootstrapper : Found @SpringBootConfiguration org.vaadin.addons.dramafinder.tests.TestServer for test class org.vaadin.addons.dramafinder.tests.it.SplitLayoutViewIT
[INFO] Tests run: 32, Failures: 0, Errors: 0, Skipped: 0, Time elapsed: 73.82 s -- in org.vaadin.addons.dramafinder.tests.it.MultiSelectComboBoxViewIT
[INFO] Running org.vaadin.addons.dramafinder.tests.it.ContextMenuViewIT
2026-09-21T13:39:39.210Z INFO 230151 --- [Pool-1-worker-2] t.c.s.AnnotationConfigContextLoaderUtils : Could not detect default configuration classes for test class [org.vaadin.addons.dramafinder.tests.it.ContextMenuViewIT]: ContextMenuViewIT does not declare any static, non-private, non-final, nested classes annotated with @Configuration.
2026-09-21T13:39:39.212Z INFO 230151 --- [Pool-1-worker-2] .b.t.c.SpringBootTestContextBootstrapper : Found @SpringBootConfiguration org.vaadin.addons.dramafinder.tests.TestServer for test class org.vaadin.addons.dramafinder.tests.it.ContextMenuViewIT
2026-09-21T13:39:39.220Z INFO 230151 --- [Pool-1-worker-2] t.c.s.AnnotationConfigContextLoaderUtils : Could not detect default configuration classes for test class [org.vaadin.addons.dramafinder.tests.it.ContextMenuViewIT]: ContextMenuViewIT does not declare any static, non-private, non-final, nested classes annotated with @Configuration.
2026-09-21T13:39:39.222Z INFO 230151 --- [Pool-1-worker-2] t.c.s.AnnotationConfigContextLoaderUtils : Could not detect default configuration classes for test class [org.vaadin.addons.dramafinder.tests.it.SpringPlaywrightIT]: SpringPlaywrightIT does not declare any static, non-private, non-final, nested classes annotated with @Configuration.
2026-09-21T13:39:39.222Z INFO 230151 --- [Pool-1-worker-2] t.c.s.AnnotationConfigContextLoaderUtils : Could not detect default configuration classes for test class [org.vaadin.addons.dramafinder.AbstractBasePlaywrightIT]: AbstractBasePlaywrightIT does not declare any static, non-private, non-final, nested classes annotated with @Configuration.
2026-09-21T13:39:39.223Z INFO 230151 --- [Pool-1-worker-2] .b.t.c.SpringBootTestContextBootstrapper : Found @SpringBootConfiguration org.vaadin.addons.dramafinder.tests.TestServer for test class org.vaadin.addons.dramafinder.tests.it.ContextMenuViewIT
[INFO] Tests run: 4, Failures: 0, Errors: 0, Skipped: 0, Time elapsed: 10.51 s -- in org.vaadin.addons.dramafinder.tests.it.SplitLayoutViewIT
[INFO] Running org.vaadin.addons.dramafinder.tests.it.IntegerFieldViewIT
2026-09-21T13:39:39.570Z INFO 230151 --- [Pool-1-worker-1] t.c.s.AnnotationConfigContextLoaderUtils : Could not detect default configuration classes for test class [org.vaadin.addons.dramafinder.tests.it.IntegerFieldViewIT]: IntegerFieldViewIT does not declare any static, non-private, non-final, nested classes annotated with @Configuration.
2026-09-21T13:39:39.577Z INFO 230151 --- [Pool-1-worker-1] .b.t.c.SpringBootTestContextBootstrapper : Found @SpringBootConfiguration org.vaadin.addons.dramafinder.tests.TestServer for test class org.vaadin.addons.dramafinder.tests.it.IntegerFieldViewIT
2026-09-21T13:39:39.578Z INFO 230151 --- [Pool-1-worker-1] t.c.s.AnnotationConfigContextLoaderUtils : Could not detect default configuration classes for test class [org.vaadin.addons.dramafinder.tests.it.IntegerFieldViewIT]: IntegerFieldViewIT does not declare any static, non-private, non-final, nested classes annotated with @Configuration.
2026-09-21T13:39:39.579Z INFO 230151 --- [Pool-1-worker-1] t.c.s.AnnotationConfigContextLoaderUtils : Could not detect default configuration classes for test class [org.vaadin.addons.dramafinder.tests.it.SpringPlaywrightIT]: SpringPlaywrightIT does not declare any static, non-private, non-final, nested classes annotated with @Configuration.
2026-09-21T13:39:39.579Z INFO 230151 --- [Pool-1-worker-1] t.c.s.AnnotationConfigContextLoaderUtils : Could not detect default configuration classes for test class [org.vaadin.addons.dramafinder.AbstractBasePlaywrightIT]: AbstractBasePlaywrightIT does not declare any static, non-private, non-final, nested classes annotated with @Configuration.
2026-09-21T13:39:39.582Z INFO 230151 --- [Pool-1-worker-1] .b.t.c.SpringBootTestContextBootstrapper : Found @SpringBootConfiguration org.vaadin.addons.dramafinder.tests.TestServer for test class org.vaadin.addons.dramafinder.tests.it.IntegerFieldViewIT
[INFO] Tests run: 4, Failures: 0, Errors: 0, Skipped: 0, Time elapsed: 8.738 s -- in org.vaadin.addons.dramafinder.tests.it.IntegerFieldViewIT
[INFO] Running org.vaadin.addons.dramafinder.tests.it.DetailsViewIT
2026-09-21T13:39:48.317Z INFO 230151 --- [Pool-1-worker-1] t.c.s.AnnotationConfigContextLoaderUtils : Could not detect default configuration classes for test class [org.vaadin.addons.dramafinder.tests.it.DetailsViewIT]: DetailsViewIT does not declare any static, non-private, non-final, nested classes annotated with @Configuration.
2026-09-21T13:39:48.318Z INFO 230151 --- [Pool-1-worker-1] .b.t.c.SpringBootTestContextBootstrapper : Found @SpringBootConfiguration org.vaadin.addons.dramafinder.tests.TestServer for test class org.vaadin.addons.dramafinder.tests.it.DetailsViewIT
2026-09-21T13:39:48.325Z INFO 230151 --- [Pool-1-worker-1] t.c.s.AnnotationConfigContextLoaderUtils : Could not detect default configuration classes for test class [org.vaadin.addons.dramafinder.tests.it.DetailsViewIT]: DetailsViewIT does not declare any static, non-private, non-final, nested classes annotated with @Configuration.
2026-09-21T13:39:48.325Z INFO 230151 --- [Pool-1-worker-1] t.c.s.AnnotationConfigContextLoaderUtils : Could not detect default configuration classes for test class [org.vaadin.addons.dramafinder.tests.it.SpringPlaywrightIT]: SpringPlaywrightIT does not declare any static, non-private, non-final, nested classes annotated with @Configuration.
2026-09-21T13:39:48.325Z INFO 230151 --- [Pool-1-worker-1] t.c.s.AnnotationConfigContextLoaderUtils : Could not detect default configuration classes for test class [org.vaadin.addons.dramafinder.AbstractBasePlaywrightIT]: AbstractBasePlaywrightIT does not declare any static, non-private, non-final, nested classes annotated with @Configuration.
2026-09-21T13:39:48.326Z INFO 230151 --- [Pool-1-worker-1] .b.t.c.SpringBootTestContextBootstrapper : Found @SpringBootConfiguration org.vaadin.addons.dramafinder.tests.TestServer for test class org.vaadin.addons.dramafinder.tests.it.DetailsViewIT
[INFO] Tests run: 6, Failures: 0, Errors: 0, Skipped: 0, Time elapsed: 14.39 s -- in org.vaadin.addons.dramafinder.tests.it.ContextMenuViewIT
[INFO] Running org.vaadin.addons.dramafinder.tests.it.PopoverViewIT
2026-09-21T13:39:53.593Z INFO 230151 --- [Pool-1-worker-2] t.c.s.AnnotationConfigContextLoaderUtils : Could not detect default configuration classes for test class [org.vaadin.addons.dramafinder.tests.it.PopoverViewIT]: PopoverViewIT does not declare any static, non-private, non-final, nested classes annotated with @Configuration.
2026-09-21T13:39:53.603Z INFO 230151 --- [Pool-1-worker-2] .b.t.c.SpringBootTestContextBootstrapper : Found @SpringBootConfiguration org.vaadin.addons.dramafinder.tests.TestServer for test class org.vaadin.addons.dramafinder.tests.it.PopoverViewIT
2026-09-21T13:39:53.609Z INFO 230151 --- [Pool-1-worker-2] t.c.s.AnnotationConfigContextLoaderUtils : Could not detect default configuration classes for test class [org.vaadin.addons.dramafinder.tests.it.PopoverViewIT]: PopoverViewIT does not declare any static, non-private, non-final, nested classes annotated with @Configuration.
2026-09-21T13:39:53.609Z INFO 230151 --- [Pool-1-worker-2] t.c.s.AnnotationConfigContextLoaderUtils : Could not detect default configuration classes for test class [org.vaadin.addons.dramafinder.tests.it.SpringPlaywrightIT]: SpringPlaywrightIT does not declare any static, non-private, non-final, nested classes annotated with @Configuration.
2026-09-21T13:39:53.610Z INFO 230151 --- [Pool-1-worker-2] t.c.s.AnnotationConfigContextLoaderUtils : Could not detect default configuration classes for test class [org.vaadin.addons.dramafinder.AbstractBasePlaywrightIT]: AbstractBasePlaywrightIT does not declare any static, non-private, non-final, nested classes annotated with @Configuration.
2026-09-21T13:39:53.616Z INFO 230151 --- [Pool-1-worker-2] .b.t.c.SpringBootTestContextBootstrapper : Found @SpringBootConfiguration org.vaadin.addons.dramafinder.tests.TestServer for test class org.vaadin.addons.dramafinder.tests.it.PopoverViewIT
[INFO] Tests run: 7, Failures: 0, Errors: 0, Skipped: 0, Time elapsed: 14.84 s -- in org.vaadin.addons.dramafinder.tests.it.DetailsViewIT
[INFO] Running org.vaadin.addons.dramafinder.tests.it.BreadcrumbsViewIT
2026-09-21T13:40:03.164Z INFO 230151 --- [Pool-1-worker-1] t.c.s.AnnotationConfigContextLoaderUtils : Could not detect default configuration classes for test class [org.vaadin.addons.dramafinder.tests.it.BreadcrumbsViewIT]: BreadcrumbsViewIT does not declare any static, non-private, non-final, nested classes annotated with @Configuration.
2026-09-21T13:40:03.166Z INFO 230151 --- [Pool-1-worker-1] .b.t.c.SpringBootTestContextBootstrapper : Found @SpringBootConfiguration org.vaadin.addons.dramafinder.tests.TestServer for test class org.vaadin.addons.dramafinder.tests.it.BreadcrumbsViewIT
2026-09-21T13:40:03.168Z INFO 230151 --- [Pool-1-worker-1] t.c.s.AnnotationConfigContextLoaderUtils : Could not detect default configuration classes for test class [org.vaadin.addons.dramafinder.tests.it.BreadcrumbsViewIT]: BreadcrumbsViewIT does not declare any static, non-private, non-final, nested classes annotated with @Configuration.
2026-09-21T13:40:03.168Z INFO 230151 --- [Pool-1-worker-1] t.c.s.AnnotationConfigContextLoaderUtils : Could not detect default configuration classes for test class [org.vaadin.addons.dramafinder.tests.it.SpringPlaywrightIT]: SpringPlaywrightIT does not declare any static, non-private, non-final, nested classes annotated with @Configuration.
2026-09-21T13:40:03.169Z INFO 230151 --- [Pool-1-worker-1] t.c.s.AnnotationConfigContextLoaderUtils : Could not detect default configuration classes for test class [org.vaadin.addons.dramafinder.AbstractBasePlaywrightIT]: AbstractBasePlaywrightIT does not declare any static, non-private, non-final, nested classes annotated with @Configuration.
2026-09-21T13:40:03.170Z INFO 230151 --- [Pool-1-worker-1] .b.t.c.SpringBootTestContextBootstrapper : Found @SpringBootConfiguration org.vaadin.addons.dramafinder.tests.TestServer for test class org.vaadin.addons.dramafinder.tests.it.BreadcrumbsViewIT
[INFO] Tests run: 21, Failures: 0, Errors: 0, Skipped: 0, Time elapsed: 41.59 s -- in org.vaadin.addons.dramafinder.tests.it.TooltipViewIT
[INFO] Running org.vaadin.addons.dramafinder.tests.it.AppLayoutViewIT
2026-09-21T13:40:03.193Z INFO 230151 --- [Pool-1-worker-3] t.c.s.AnnotationConfigContextLoaderUtils : Could not detect default configuration classes for test class [org.vaadin.addons.dramafinder.tests.it.AppLayoutViewIT]: AppLayoutViewIT does not declare any static, non-private, non-final, nested classes annotated with @Configuration.
2026-09-21T13:40:03.197Z INFO 230151 --- [Pool-1-worker-3] .b.t.c.SpringBootTestContextBootstrapper : Found @SpringBootConfiguration org.vaadin.addons.dramafinder.tests.TestServer for test class org.vaadin.addons.dramafinder.tests.it.AppLayoutViewIT
2026-09-21T13:40:03.198Z INFO 230151 --- [Pool-1-worker-3] t.c.s.AnnotationConfigContextLoaderUtils : Could not detect default configuration classes for test class [org.vaadin.addons.dramafinder.tests.it.AppLayoutViewIT]: AppLayoutViewIT does not declare any static, non-private, non-final, nested classes annotated with @Configuration.
2026-09-21T13:40:03.199Z INFO 230151 --- [Pool-1-worker-3] t.c.s.AnnotationConfigContextLoaderUtils : Could not detect default configuration classes for test class [org.vaadin.addons.dramafinder.tests.it.SpringPlaywrightIT]: SpringPlaywrightIT does not declare any static, non-private, non-final, nested classes annotated with @Configuration.
2026-09-21T13:40:03.199Z INFO 230151 --- [Pool-1-worker-3] t.c.s.AnnotationConfigContextLoaderUtils : Could not detect default configuration classes for test class [org.vaadin.addons.dramafinder.AbstractBasePlaywrightIT]: AbstractBasePlaywrightIT does not declare any static, non-private, non-final, nested classes annotated with @Configuration.
2026-09-21T13:40:03.211Z INFO 230151 --- [Pool-1-worker-3] .b.t.c.SpringBootTestContextBootstrapper : Found @SpringBootConfiguration org.vaadin.addons.dramafinder.tests.TestServer for test class org.vaadin.addons.dramafinder.tests.it.AppLayoutViewIT
[INFO] Tests run: 5, Failures: 0, Errors: 0, Skipped: 0, Time elapsed: 11.42 s -- in org.vaadin.addons.dramafinder.tests.it.PopoverViewIT
[INFO] Running org.vaadin.addons.dramafinder.tests.it.MenuBarViewIT
2026-09-21T13:40:05.019Z INFO 230151 --- [Pool-1-worker-2] t.c.s.AnnotationConfigContextLoaderUtils : Could not detect default configuration classes for test class [org.vaadin.addons.dramafinder.tests.it.MenuBarViewIT]: MenuBarViewIT does not declare any static, non-private, non-final, nested classes annotated with @Configuration.
2026-09-21T13:40:05.021Z INFO 230151 --- [Pool-1-worker-2] .b.t.c.SpringBootTestContextBootstrapper : Found @SpringBootConfiguration org.vaadin.addons.dramafinder.tests.TestServer for test class org.vaadin.addons.dramafinder.tests.it.MenuBarViewIT
2026-09-21T13:40:05.022Z INFO 230151 --- [Pool-1-worker-2] t.c.s.AnnotationConfigContextLoaderUtils : Could not detect default configuration classes for test class [org.vaadin.addons.dramafinder.tests.it.MenuBarViewIT]: MenuBarViewIT does not declare any static, non-private, non-final, nested classes annotated with @Configuration.
2026-09-21T13:40:05.025Z INFO 230151 --- [Pool-1-worker-2] t.c.s.AnnotationConfigContextLoaderUtils : Could not detect default configuration classes for test class [org.vaadin.addons.dramafinder.tests.it.SpringPlaywrightIT]: SpringPlaywrightIT does not declare any static, non-private, non-final, nested classes annotated with @Configuration.
2026-09-21T13:40:05.025Z INFO 230151 --- [Pool-1-worker-2] t.c.s.AnnotationConfigContextLoaderUtils : Could not detect default configuration classes for test class [org.vaadin.addons.dramafinder.AbstractBasePlaywrightIT]: AbstractBasePlaywrightIT does not declare any static, non-private, non-final, nested classes annotated with @Configuration.
2026-09-21T13:40:05.026Z INFO 230151 --- [Pool-1-worker-2] .b.t.c.SpringBootTestContextBootstrapper : Found @SpringBootConfiguration org.vaadin.addons.dramafinder.tests.TestServer for test class org.vaadin.addons.dramafinder.tests.it.MenuBarViewIT
2026-09-21T13:40:10.130Z WARN 230151 --- [-auto-1-exec-15] com.vaadin.flow.dom.impl.ThemeListImpl : Theme name 'badge success' contains spaces and was added as the separate theme names [badge, success]. Add one theme name per add() call, use HasTheme.addThemeNames(String...), or use Element.setAttribute("theme", ...) to set a space separated value. Only add() splits such a value, so contains(), remove() and the other operations will not match it, and support for it may be removed in a future version.
[INFO] Tests run: 4, Failures: 0, Errors: 0, Skipped: 0, Time elapsed: 8.541 s -- in org.vaadin.addons.dramafinder.tests.it.MenuBarViewIT
[INFO] Running org.vaadin.addons.dramafinder.tests.it.MultiSelectComboBoxGetByLabelIT
2026-09-21T13:40:13.562Z INFO 230151 --- [Pool-1-worker-2] t.c.s.AnnotationConfigContextLoaderUtils : Could not detect default configuration classes for test class [org.vaadin.addons.dramafinder.tests.it.MultiSelectComboBoxGetByLabelIT]: MultiSelectComboBoxGetByLabelIT does not declare any static, non-private, non-final, nested classes annotated with @Configuration.
2026-09-21T13:40:13.564Z INFO 230151 --- [Pool-1-worker-2] .b.t.c.SpringBootTestContextBootstrapper : Found @SpringBootConfiguration org.vaadin.addons.dramafinder.tests.TestServer for test class org.vaadin.addons.dramafinder.tests.it.MultiSelectComboBoxGetByLabelIT
2026-09-21T13:40:13.568Z INFO 230151 --- [Pool-1-worker-2] t.c.s.AnnotationConfigContextLoaderUtils : Could not detect default configuration classes for test class [org.vaadin.addons.dramafinder.tests.it.MultiSelectComboBoxGetByLabelIT]: MultiSelectComboBoxGetByLabelIT does not declare any static, non-private, non-final, nested classes annotated with @Configuration.
2026-09-21T13:40:13.568Z INFO 230151 --- [Pool-1-worker-2] t.c.s.AnnotationConfigContextLoaderUtils : Could not detect default configuration classes for test class [org.vaadin.addons.dramafinder.tests.it.SpringPlaywrightIT]: SpringPlaywrightIT does not declare any static, non-private, non-final, nested classes annotated with @Configuration.
2026-09-21T13:40:13.569Z INFO 230151 --- [Pool-1-worker-2] t.c.s.AnnotationConfigContextLoaderUtils : Could not detect default configuration classes for test class [org.vaadin.addons.dramafinder.AbstractBasePlaywrightIT]: AbstractBasePlaywrightIT does not declare any static, non-private, non-final, nested classes annotated with @Configuration.
2026-09-21T13:40:13.570Z INFO 230151 --- [Pool-1-worker-2] .b.t.c.SpringBootTestContextBootstrapper : Found @SpringBootConfiguration org.vaadin.addons.dramafinder.tests.TestServer for test class org.vaadin.addons.dramafinder.tests.it.MultiSelectComboBoxGetByLabelIT
[INFO] Tests run: 3, Failures: 0, Errors: 0, Skipped: 0, Time elapsed: 5.381 s -- in org.vaadin.addons.dramafinder.tests.it.MultiSelectComboBoxGetByLabelIT
[INFO] Running org.vaadin.addons.dramafinder.tests.it.MessageListViewIT
2026-09-21T13:40:18.943Z INFO 230151 --- [Pool-1-worker-2] t.c.s.AnnotationConfigContextLoaderUtils : Could not detect default configuration classes for test class [org.vaadin.addons.dramafinder.tests.it.MessageListViewIT]: MessageListViewIT does not declare any static, non-private, non-final, nested classes annotated with @Configuration.
2026-09-21T13:40:18.946Z INFO 230151 --- [Pool-1-worker-2] .b.t.c.SpringBootTestContextBootstrapper : Found @SpringBootConfiguration org.vaadin.addons.dramafinder.tests.TestServer for test class org.vaadin.addons.dramafinder.tests.it.MessageListViewIT
2026-09-21T13:40:18.949Z INFO 230151 --- [Pool-1-worker-2] t.c.s.AnnotationConfigContextLoaderUtils : Could not detect default configuration classes for test class [org.vaadin.addons.dramafinder.tests.it.MessageListViewIT]: MessageListViewIT does not declare any static, non-private, non-final, nested classes annotated with @Configuration.
2026-09-21T13:40:18.949Z INFO 230151 --- [Pool-1-worker-2] t.c.s.AnnotationConfigContextLoaderUtils : Could not detect default configuration classes for test class [org.vaadin.addons.dramafinder.tests.it.SpringPlaywrightIT]: SpringPlaywrightIT does not declare any static, non-private, non-final, nested classes annotated with @Configuration.
2026-09-21T13:40:18.949Z INFO 230151 --- [Pool-1-worker-2] t.c.s.AnnotationConfigContextLoaderUtils : Could not detect default configuration classes for test class [org.vaadin.addons.dramafinder.AbstractBasePlaywrightIT]: AbstractBasePlaywrightIT does not declare any static, non-private, non-final, nested classes annotated with @Configuration.
2026-09-21T13:40:18.976Z INFO 230151 --- [Pool-1-worker-2] .b.t.c.SpringBootTestContextBootstrapper : Found @SpringBootConfiguration org.vaadin.addons.dramafinder.tests.TestServer for test class org.vaadin.addons.dramafinder.tests.it.MessageListViewIT
[INFO] Tests run: 12, Failures: 0, Errors: 0, Skipped: 0, Time elapsed: 21.48 s -- in org.vaadin.addons.dramafinder.tests.it.BreadcrumbsViewIT
[INFO] Running org.vaadin.addons.dramafinder.tests.it.EmailFieldViewIT
2026-09-21T13:40:24.648Z INFO 230151 --- [Pool-1-worker-1] t.c.s.AnnotationConfigContextLoaderUtils : Could not detect default configuration classes for test class [org.vaadin.addons.dramafinder.tests.it.EmailFieldViewIT]: EmailFieldViewIT does not declare any static, non-private, non-final, nested classes annotated with @Configuration.
2026-09-21T13:40:24.651Z INFO 230151 --- [Pool-1-worker-1] .b.t.c.SpringBootTestContextBootstrapper : Found @SpringBootConfiguration org.vaadin.addons.dramafinder.tests.TestServer for test class org.vaadin.addons.dramafinder.tests.it.EmailFieldViewIT
2026-09-21T13:40:24.652Z INFO 230151 --- [Pool-1-worker-1] t.c.s.AnnotationConfigContextLoaderUtils : Could not detect default configuration classes for test class [org.vaadin.addons.dramafinder.tests.it.EmailFieldViewIT]: EmailFieldViewIT does not declare any static, non-private, non-final, nested classes annotated with @Configuration.
2026-09-21T13:40:24.657Z INFO 230151 --- [Pool-1-worker-1] t.c.s.AnnotationConfigContextLoaderUtils : Could not detect default configuration classes for test class [org.vaadin.addons.dramafinder.tests.it.SpringPlaywrightIT]: SpringPlaywrightIT does not declare any static, non-private, non-final, nested classes annotated with @Configuration.
2026-09-21T13:40:24.658Z INFO 230151 --- [Pool-1-worker-1] t.c.s.AnnotationConfigContextLoaderUtils : Could not detect default configuration classes for test class [org.vaadin.addons.dramafinder.AbstractBasePlaywrightIT]: AbstractBasePlaywrightIT does not declare any static, non-private, non-final, nested classes annotated with @Configuration.
2026-09-21T13:40:24.659Z INFO 230151 --- [Pool-1-worker-1] .b.t.c.SpringBootTestContextBootstrapper : Found @SpringBootConfiguration org.vaadin.addons.dramafinder.tests.TestServer for test class org.vaadin.addons.dramafinder.tests.it.EmailFieldViewIT
[INFO] Tests run: 4, Failures: 0, Errors: 0, Skipped: 0, Time elapsed: 7.293 s -- in org.vaadin.addons.dramafinder.tests.it.MessageListViewIT
[INFO] Running org.vaadin.addons.dramafinder.tests.it.GridSelectionViewIT
2026-09-21T13:40:26.235Z INFO 230151 --- [Pool-1-worker-2] t.c.s.AnnotationConfigContextLoaderUtils : Could not detect default configuration classes for test class [org.vaadin.addons.dramafinder.tests.it.GridSelectionViewIT]: GridSelectionViewIT does not declare any static, non-private, non-final, nested classes annotated with @Configuration.
2026-09-21T13:40:26.237Z INFO 230151 --- [Pool-1-worker-2] .b.t.c.SpringBootTestContextBootstrapper : Found @SpringBootConfiguration org.vaadin.addons.dramafinder.tests.TestServer for test class org.vaadin.addons.dramafinder.tests.it.GridSelectionViewIT
2026-09-21T13:40:26.238Z INFO 230151 --- [Pool-1-worker-2] t.c.s.AnnotationConfigContextLoaderUtils : Could not detect default configuration classes for test class [org.vaadin.addons.dramafinder.tests.it.GridSelectionViewIT]: GridSelectionViewIT does not declare any static, non-private, non-final, nested classes annotated with @Configuration.
2026-09-21T13:40:26.238Z INFO 230151 --- [Pool-1-worker-2] t.c.s.AnnotationConfigContextLoaderUtils : Could not detect default configuration classes for test class [org.vaadin.addons.dramafinder.tests.it.SpringPlaywrightIT]: SpringPlaywrightIT does not declare any static, non-private, non-final, nested classes annotated with @Configuration.
2026-09-21T13:40:26.239Z INFO 230151 --- [Pool-1-worker-2] t.c.s.AnnotationConfigContextLoaderUtils : Could not detect default configuration classes for test class [org.vaadin.addons.dramafinder.AbstractBasePlaywrightIT]: AbstractBasePlaywrightIT does not declare any static, non-private, non-final, nested classes annotated with @Configuration.
2026-09-21T13:40:26.239Z INFO 230151 --- [Pool-1-worker-2] .b.t.c.SpringBootTestContextBootstrapper : Found @SpringBootConfiguration org.vaadin.addons.dramafinder.tests.TestServer for test class org.vaadin.addons.dramafinder.tests.it.GridSelectionViewIT
[INFO] Tests run: 3, Failures: 0, Errors: 0, Skipped: 0, Time elapsed: 6.198 s -- in org.vaadin.addons.dramafinder.tests.it.EmailFieldViewIT
[INFO] Running org.vaadin.addons.dramafinder.tests.it.NumberFieldGetByLabelIT
2026-09-21T13:40:30.836Z INFO 230151 --- [Pool-1-worker-1] t.c.s.AnnotationConfigContextLoaderUtils : Could not detect default configuration classes for test class [org.vaadin.addons.dramafinder.tests.it.NumberFieldGetByLabelIT]: NumberFieldGetByLabelIT does not declare any static, non-private, non-final, nested classes annotated with @Configuration.
2026-09-21T13:40:30.845Z INFO 230151 --- [Pool-1-worker-1] .b.t.c.SpringBootTestContextBootstrapper : Found @SpringBootConfiguration org.vaadin.addons.dramafinder.tests.TestServer for test class org.vaadin.addons.dramafinder.tests.it.NumberFieldGetByLabelIT
2026-09-21T13:40:30.846Z INFO 230151 --- [Pool-1-worker-1] t.c.s.AnnotationConfigContextLoaderUtils : Could not detect default configuration classes for test class [org.vaadin.addons.dramafinder.tests.it.NumberFieldGetByLabelIT]: NumberFieldGetByLabelIT does not declare any static, non-private, non-final, nested classes annotated with @Configuration.
2026-09-21T13:40:30.846Z INFO 230151 --- [Pool-1-worker-1] t.c.s.AnnotationConfigContextLoaderUtils : Could not detect default configuration classes for test class [org.vaadin.addons.dramafinder.tests.it.SpringPlaywrightIT]: SpringPlaywrightIT does not declare any static, non-private, non-final, nested classes annotated with @Configuration.
2026-09-21T13:40:30.848Z INFO 230151 --- [Pool-1-worker-1] t.c.s.AnnotationConfigContextLoaderUtils : Could not detect default configuration classes for test class [org.vaadin.addons.dramafinder.AbstractBasePlaywrightIT]: AbstractBasePlaywrightIT does not declare any static, non-private, non-final, nested classes annotated with @Configuration.
2026-09-21T13:40:30.848Z INFO 230151 --- [Pool-1-worker-1] .b.t.c.SpringBootTestContextBootstrapper : Found @SpringBootConfiguration org.vaadin.addons.dramafinder.tests.TestServer for test class org.vaadin.addons.dramafinder.tests.it.NumberFieldGetByLabelIT
[INFO] Tests run: 3, Failures: 0, Errors: 0, Skipped: 0, Time elapsed: 6.645 s -- in org.vaadin.addons.dramafinder.tests.it.NumberFieldGetByLabelIT
[INFO] Running org.vaadin.addons.dramafinder.tests.it.DatePickerViewIT
2026-09-21T13:40:37.482Z INFO 230151 --- [Pool-1-worker-1] t.c.s.AnnotationConfigContextLoaderUtils : Could not detect default configuration classes for test class [org.vaadin.addons.dramafinder.tests.it.DatePickerViewIT]: DatePickerViewIT does not declare any static, non-private, non-final, nested classes annotated with @Configuration.
2026-09-21T13:40:37.495Z INFO 230151 --- [Pool-1-worker-1] .b.t.c.SpringBootTestContextBootstrapper : Found @SpringBootConfiguration org.vaadin.addons.dramafinder.tests.TestServer for test class org.vaadin.addons.dramafinder.tests.it.DatePickerViewIT
2026-09-21T13:40:37.496Z INFO 230151 --- [Pool-1-worker-1] t.c.s.AnnotationConfigContextLoaderUtils : Could not detect default configuration classes for test class [org.vaadin.addons.dramafinder.tests.it.DatePickerViewIT]: DatePickerViewIT does not declare any static, non-private, non-final, nested classes annotated with @Configuration.
2026-09-21T13:40:37.496Z INFO 230151 --- [Pool-1-worker-1] t.c.s.AnnotationConfigContextLoaderUtils : Could not detect default configuration classes for test class [org.vaadin.addons.dramafinder.tests.it.SpringPlaywrightIT]: SpringPlaywrightIT does not declare any static, non-private, non-final, nested classes annotated with @Configuration.
2026-09-21T13:40:37.496Z INFO 230151 --- [Pool-1-worker-1] t.c.s.AnnotationConfigContextLoaderUtils : Could not detect default configuration classes for test class [org.vaadin.addons.dramafinder.AbstractBasePlaywrightIT]: AbstractBasePlaywrightIT does not declare any static, non-private, non-final, nested classes annotated with @Configuration.
2026-09-21T13:40:37.497Z INFO 230151 --- [Pool-1-worker-1] .b.t.c.SpringBootTestContextBootstrapper : Found @SpringBootConfiguration org.vaadin.addons.dramafinder.tests.TestServer for test class org.vaadin.addons.dramafinder.tests.it.DatePickerViewIT
[INFO] Tests run: 22, Failures: 0, Errors: 0, Skipped: 0, Time elapsed: 39.66 s -- in org.vaadin.addons.dramafinder.tests.it.AppLayoutViewIT
[INFO] Running org.vaadin.addons.dramafinder.tests.it.PasswordFieldViewIT
2026-09-21T13:40:42.861Z INFO 230151 --- [Pool-1-worker-3] t.c.s.AnnotationConfigContextLoaderUtils : Could not detect default configuration classes for test class [org.vaadin.addons.dramafinder.tests.it.PasswordFieldViewIT]: PasswordFieldViewIT does not declare any static, non-private, non-final, nested classes annotated with @Configuration.
2026-09-21T13:40:42.865Z INFO 230151 --- [Pool-1-worker-3] .b.t.c.SpringBootTestContextBootstrapper : Found @SpringBootConfiguration org.vaadin.addons.dramafinder.tests.TestServer for test class org.vaadin.addons.dramafinder.tests.it.PasswordFieldViewIT
2026-09-21T13:40:42.868Z INFO 230151 --- [Pool-1-worker-3] t.c.s.AnnotationConfigContextLoaderUtils : Could not detect default configuration classes for test class [org.vaadin.addons.dramafinder.tests.it.PasswordFieldViewIT]: PasswordFieldViewIT does not declare any static, non-private, non-final, nested classes annotated with @Configuration.
2026-09-21T13:40:42.868Z INFO 230151 --- [Pool-1-worker-3] t.c.s.AnnotationConfigContextLoaderUtils : Could not detect default configuration classes for test class [org.vaadin.addons.dramafinder.tests.it.SpringPlaywrightIT]: SpringPlaywrightIT does not declare any static, non-private, non-final, nested classes annotated with @Configuration.
2026-09-21T13:40:42.868Z INFO 230151 --- [Pool-1-worker-3] t.c.s.AnnotationConfigContextLoaderUtils : Could not detect default configuration classes for test class [org.vaadin.addons.dramafinder.AbstractBasePlaywrightIT]: AbstractBasePlaywrightIT does not declare any static, non-private, non-final, nested classes annotated with @Configuration.
2026-09-21T13:40:42.870Z INFO 230151 --- [Pool-1-worker-3] .b.t.c.SpringBootTestContextBootstrapper : Found @SpringBootConfiguration org.vaadin.addons.dramafinder.tests.TestServer for test class org.vaadin.addons.dramafinder.tests.it.PasswordFieldViewIT
[INFO] Tests run: 8, Failures: 0, Errors: 0, Skipped: 0, Time elapsed: 22.43 s -- in org.vaadin.addons.dramafinder.tests.it.GridSelectionViewIT
[INFO] Running org.vaadin.addons.dramafinder.tests.it.TextAreaGetByLabelIT
2026-09-21T13:40:48.673Z INFO 230151 --- [Pool-1-worker-2] t.c.s.AnnotationConfigContextLoaderUtils : Could not detect default configuration classes for test class [org.vaadin.addons.dramafinder.tests.it.TextAreaGetByLabelIT]: TextAreaGetByLabelIT does not declare any static, non-private, non-final, nested classes annotated with @Configuration.
2026-09-21T13:40:48.674Z INFO 230151 --- [Pool-1-worker-2] .b.t.c.SpringBootTestContextBootstrapper : Found @SpringBootConfiguration org.vaadin.addons.dramafinder.tests.TestServer for test class org.vaadin.addons.dramafinder.tests.it.TextAreaGetByLabelIT
2026-09-21T13:40:48.675Z INFO 230151 --- [Pool-1-worker-2] t.c.s.AnnotationConfigContextLoaderUtils : Could not detect default configuration classes for test class [org.vaadin.addons.dramafinder.tests.it.TextAreaGetByLabelIT]: TextAreaGetByLabelIT does not declare any static, non-private, non-final, nested classes annotated with @Configuration.
2026-09-21T13:40:48.677Z INFO 230151 --- [Pool-1-worker-2] t.c.s.AnnotationConfigContextLoaderUtils : Could not detect default configuration classes for test class [org.vaadin.addons.dramafinder.tests.it.SpringPlaywrightIT]: SpringPlaywrightIT does not declare any static, non-private, non-final, nested classes annotated with @Configuration.
2026-09-21T13:40:48.680Z INFO 230151 --- [Pool-1-worker-2] t.c.s.AnnotationConfigContextLoaderUtils : Could not detect default configuration classes for test class [org.vaadin.addons.dramafinder.AbstractBasePlaywrightIT]: AbstractBasePlaywrightIT does not declare any static, non-private, non-final, nested classes annotated with @Configuration.
2026-09-21T13:40:48.681Z INFO 230151 --- [Pool-1-worker-2] .b.t.c.SpringBootTestContextBootstrapper : Found @SpringBootConfiguration org.vaadin.addons.dramafinder.tests.TestServer for test class org.vaadin.addons.dramafinder.tests.it.TextAreaGetByLabelIT
[INFO] Tests run: 2, Failures: 0, Errors: 0, Skipped: 0, Time elapsed: 4.117 s -- in org.vaadin.addons.dramafinder.tests.it.TextAreaGetByLabelIT
[INFO] Running org.vaadin.addons.dramafinder.tests.it.SelectViewIT
2026-09-21T13:40:52.785Z INFO 230151 --- [Pool-1-worker-2] t.c.s.AnnotationConfigContextLoaderUtils : Could not detect default configuration classes for test class [org.vaadin.addons.dramafinder.tests.it.SelectViewIT]: SelectViewIT does not declare any static, non-private, non-final, nested classes annotated with @Configuration.
2026-09-21T13:40:52.800Z INFO 230151 --- [Pool-1-worker-2] .b.t.c.SpringBootTestContextBootstrapper : Found @SpringBootConfiguration org.vaadin.addons.dramafinder.tests.TestServer for test class org.vaadin.addons.dramafinder.tests.it.SelectViewIT
2026-09-21T13:40:52.801Z INFO 230151 --- [Pool-1-worker-2] t.c.s.AnnotationConfigContextLoaderUtils : Could not detect default configuration classes for test class [org.vaadin.addons.dramafinder.tests.it.SelectViewIT]: SelectViewIT does not declare any static, non-private, non-final, nested classes annotated with @Configuration.
2026-09-21T13:40:52.812Z INFO 230151 --- [Pool-1-worker-2] t.c.s.AnnotationConfigContextLoaderUtils : Could not detect default configuration classes for test class [org.vaadin.addons.dramafinder.tests.it.SpringPlaywrightIT]: SpringPlaywrightIT does not declare any static, non-private, non-final, nested classes annotated with @Configuration.
2026-09-21T13:40:52.813Z INFO 230151 --- [Pool-1-worker-2] t.c.s.AnnotationConfigContextLoaderUtils : Could not detect default configuration classes for test class [org.vaadin.addons.dramafinder.AbstractBasePlaywrightIT]: AbstractBasePlaywrightIT does not declare any static, non-private, non-final, nested classes annotated with @Configuration.
2026-09-21T13:40:52.814Z INFO 230151 --- [Pool-1-worker-2] .b.t.c.SpringBootTestContextBootstrapper : Found @SpringBootConfiguration org.vaadin.addons.dramafinder.tests.TestServer for test class org.vaadin.addons.dramafinder.tests.it.SelectViewIT
[INFO] Tests run: 8, Failures: 0, Errors: 0, Skipped: 0, Time elapsed: 15.61 s -- in org.vaadin.addons.dramafinder.tests.it.DatePickerViewIT
[INFO] Running org.vaadin.addons.dramafinder.tests.it.ComboBoxViewIT
2026-09-21T13:40:53.090Z INFO 230151 --- [Pool-1-worker-1] t.c.s.AnnotationConfigContextLoaderUtils : Could not detect default configuration classes for test class [org.vaadin.addons.dramafinder.tests.it.ComboBoxViewIT]: ComboBoxViewIT does not declare any static, non-private, non-final, nested classes annotated with @Configuration.
2026-09-21T13:40:53.095Z INFO 230151 --- [Pool-1-worker-1] .b.t.c.SpringBootTestContextBootstrapper : Found @SpringBootConfiguration org.vaadin.addons.dramafinder.tests.TestServer for test class org.vaadin.addons.dramafinder.tests.it.ComboBoxViewIT
2026-09-21T13:40:53.099Z INFO 230151 --- [Pool-1-worker-1] t.c.s.AnnotationConfigContextLoaderUtils : Could not detect default configuration classes for test class [org.vaadin.addons.dramafinder.tests.it.ComboBoxViewIT]: ComboBoxViewIT does not declare any static, non-private, non-final, nested classes annotated with @Configuration.
2026-09-21T13:40:53.100Z INFO 230151 --- [Pool-1-worker-1] t.c.s.AnnotationConfigContextLoaderUtils : Could not detect default configuration classes for test class [org.vaadin.addons.dramafinder.tests.it.SpringPlaywrightIT]: SpringPlaywrightIT does not declare any static, non-private, non-final, nested classes annotated with @Configuration.
2026-09-21T13:40:53.100Z INFO 230151 --- [Pool-1-worker-1] t.c.s.AnnotationConfigContextLoaderUtils : Could not detect default configuration classes for test class [org.vaadin.addons.dramafinder.AbstractBasePlaywrightIT]: AbstractBasePlaywrightIT does not declare any static, non-private, non-final, nested classes annotated with @Configuration.
2026-09-21T13:40:53.100Z INFO 230151 --- [Pool-1-worker-1] .b.t.c.SpringBootTestContextBootstrapper : Found @SpringBootConfiguration org.vaadin.addons.dramafinder.tests.TestServer for test class org.vaadin.addons.dramafinder.tests.it.ComboBoxViewIT
[INFO] Tests run: 16, Failures: 0, Errors: 0, Skipped: 0, Time elapsed: 28.69 s -- in org.vaadin.addons.dramafinder.tests.it.SelectViewIT
[INFO] Running org.vaadin.addons.dramafinder.tests.it.BigDecimalFieldViewIT
2026-09-21T13:41:21.483Z INFO 230151 --- [Pool-1-worker-2] t.c.s.AnnotationConfigContextLoaderUtils : Could not detect default configuration classes for test class [org.vaadin.addons.dramafinder.tests.it.BigDecimalFieldViewIT]: BigDecimalFieldViewIT does not declare any static, non-private, non-final, nested classes annotated with @Configuration.
2026-09-21T13:41:21.487Z INFO 230151 --- [Pool-1-worker-2] .b.t.c.SpringBootTestContextBootstrapper : Found @SpringBootConfiguration org.vaadin.addons.dramafinder.tests.TestServer for test class org.vaadin.addons.dramafinder.tests.it.BigDecimalFieldViewIT
2026-09-21T13:41:21.488Z INFO 230151 --- [Pool-1-worker-2] t.c.s.AnnotationConfigContextLoaderUtils : Could not detect default configuration classes for test class [org.vaadin.addons.dramafinder.tests.it.BigDecimalFieldViewIT]: BigDecimalFieldViewIT does not declare any static, non-private, non-final, nested classes annotated with @Configuration.
2026-09-21T13:41:21.488Z INFO 230151 --- [Pool-1-worker-2] t.c.s.AnnotationConfigContextLoaderUtils : Could not detect default configuration classes for test class [org.vaadin.addons.dramafinder.tests.it.SpringPlaywrightIT]: SpringPlaywrightIT does not declare any static, non-private, non-final, nested classes annotated with @Configuration.
2026-09-21T13:41:21.489Z INFO 230151 --- [Pool-1-worker-2] t.c.s.AnnotationConfigContextLoaderUtils : Could not detect default configuration classes for test class [org.vaadin.addons.dramafinder.AbstractBasePlaywrightIT]: AbstractBasePlaywrightIT does not declare any static, non-private, non-final, nested classes annotated with @Configuration.
2026-09-21T13:41:21.490Z INFO 230151 --- [Pool-1-worker-2] .b.t.c.SpringBootTestContextBootstrapper : Found @SpringBootConfiguration org.vaadin.addons.dramafinder.tests.TestServer for test class org.vaadin.addons.dramafinder.tests.it.BigDecimalFieldViewIT
[INFO] Tests run: 23, Failures: 0, Errors: 0, Skipped: 0, Time elapsed: 40.63 s -- in org.vaadin.addons.dramafinder.tests.it.PasswordFieldViewIT
[INFO] Running org.vaadin.addons.dramafinder.tests.it.TreeGridMultiSelectViewIT
2026-09-21T13:41:23.488Z INFO 230151 --- [Pool-1-worker-3] t.c.s.AnnotationConfigContextLoaderUtils : Could not detect default configuration classes for test class [org.vaadin.addons.dramafinder.tests.it.TreeGridMultiSelectViewIT]: TreeGridMultiSelectViewIT does not declare any static, non-private, non-final, nested classes annotated with @Configuration.
2026-09-21T13:41:23.491Z INFO 230151 --- [Pool-1-worker-3] .b.t.c.SpringBootTestContextBootstrapper : Found @SpringBootConfiguration org.vaadin.addons.dramafinder.tests.TestServer for test class org.vaadin.addons.dramafinder.tests.it.TreeGridMultiSelectViewIT
2026-09-21T13:41:23.497Z INFO 230151 --- [Pool-1-worker-3] t.c.s.AnnotationConfigContextLoaderUtils : Could not detect default configuration classes for test class [org.vaadin.addons.dramafinder.tests.it.TreeGridMultiSelectViewIT]: TreeGridMultiSelectViewIT does not declare any static, non-private, non-final, nested classes annotated with @Configuration.
2026-09-21T13:41:23.497Z INFO 230151 --- [Pool-1-worker-3] t.c.s.AnnotationConfigContextLoaderUtils : Could not detect default configuration classes for test class [org.vaadin.addons.dramafinder.tests.it.SpringPlaywrightIT]: SpringPlaywrightIT does not declare any static, non-private, non-final, nested classes annotated with @Configuration.
2026-09-21T13:41:23.497Z INFO 230151 --- [Pool-1-worker-3] t.c.s.AnnotationConfigContextLoaderUtils : Could not detect default configuration classes for test class [org.vaadin.addons.dramafinder.AbstractBasePlaywrightIT]: AbstractBasePlaywrightIT does not declare any static, non-private, non-final, nested classes annotated with @Configuration.
2026-09-21T13:41:23.498Z INFO 230151 --- [Pool-1-worker-3] .b.t.c.SpringBootTestContextBootstrapper : Found @SpringBootConfiguration org.vaadin.addons.dramafinder.tests.TestServer for test class org.vaadin.addons.dramafinder.tests.it.TreeGridMultiSelectViewIT
[INFO] Tests run: 2, Failures: 0, Errors: 0, Skipped: 0, Time elapsed: 3.943 s -- in org.vaadin.addons.dramafinder.tests.it.BigDecimalFieldViewIT
[INFO] Running org.vaadin.addons.dramafinder.tests.it.RadioButtonGroupViewIT
2026-09-21T13:41:25.429Z INFO 230151 --- [Pool-1-worker-2] t.c.s.AnnotationConfigContextLoaderUtils : Could not detect default configuration classes for test class [org.vaadin.addons.dramafinder.tests.it.RadioButtonGroupViewIT]: RadioButtonGroupViewIT does not declare any static, non-private, non-final, nested classes annotated with @Configuration.
2026-09-21T13:41:25.431Z INFO 230151 --- [Pool-1-worker-2] .b.t.c.SpringBootTestContextBootstrapper : Found @SpringBootConfiguration org.vaadin.addons.dramafinder.tests.TestServer for test class org.vaadin.addons.dramafinder.tests.it.RadioButtonGroupViewIT
2026-09-21T13:41:25.431Z INFO 230151 --- [Pool-1-worker-2] t.c.s.AnnotationConfigContextLoaderUtils : Could not detect default configuration classes for test class [org.vaadin.addons.dramafinder.tests.it.RadioButtonGroupViewIT]: RadioButtonGroupViewIT does not declare any static, non-private, non-final, nested classes annotated with @Configuration.
2026-09-21T13:41:25.432Z INFO 230151 --- [Pool-1-worker-2] t.c.s.AnnotationConfigContextLoaderUtils : Could not detect default configuration classes for test class [org.vaadin.addons.dramafinder.tests.it.SpringPlaywrightIT]: SpringPlaywrightIT does not declare any static, non-private, non-final, nested classes annotated with @Configuration.
2026-09-21T13:41:25.432Z INFO 230151 --- [Pool-1-worker-2] t.c.s.AnnotationConfigContextLoaderUtils : Could not detect default configuration classes for test class [org.vaadin.addons.dramafinder.AbstractBasePlaywrightIT]: AbstractBasePlaywrightIT does not declare any static, non-private, non-final, nested classes annotated with @Configuration.
2026-09-21T13:41:25.437Z INFO 230151 --- [Pool-1-worker-2] .b.t.c.SpringBootTestContextBootstrapper : Found @SpringBootConfiguration org.vaadin.addons.dramafinder.tests.TestServer for test class org.vaadin.addons.dramafinder.tests.it.RadioButtonGroupViewIT
[INFO] Tests run: 5, Failures: 0, Errors: 0, Skipped: 0, Time elapsed: 8.368 s -- in org.vaadin.addons.dramafinder.tests.it.RadioButtonGroupViewIT
[INFO] Running org.vaadin.addons.dramafinder.tests.it.ButtonViewIT
2026-09-21T13:41:33.805Z INFO 230151 --- [Pool-1-worker-2] t.c.s.AnnotationConfigContextLoaderUtils : Could not detect default configuration classes for test class [org.vaadin.addons.dramafinder.tests.it.ButtonViewIT]: ButtonViewIT does not declare any static, non-private, non-final, nested classes annotated with @Configuration.
2026-09-21T13:41:33.807Z INFO 230151 --- [Pool-1-worker-2] .b.t.c.SpringBootTestContextBootstrapper : Found @SpringBootConfiguration org.vaadin.addons.dramafinder.tests.TestServer for test class org.vaadin.addons.dramafinder.tests.it.ButtonViewIT
2026-09-21T13:41:33.811Z INFO 230151 --- [Pool-1-worker-2] t.c.s.AnnotationConfigContextLoaderUtils : Could not detect default configuration classes for test class [org.vaadin.addons.dramafinder.tests.it.ButtonViewIT]: ButtonViewIT does not declare any static, non-private, non-final, nested classes annotated with @Configuration.
2026-09-21T13:41:33.811Z INFO 230151 --- [Pool-1-worker-2] t.c.s.AnnotationConfigContextLoaderUtils : Could not detect default configuration classes for test class [org.vaadin.addons.dramafinder.tests.it.SpringPlaywrightIT]: SpringPlaywrightIT does not declare any static, non-private, non-final, nested classes annotated with @Configuration.
2026-09-21T13:41:33.812Z INFO 230151 --- [Pool-1-worker-2] t.c.s.AnnotationConfigContextLoaderUtils : Could not detect default configuration classes for test class [org.vaadin.addons.dramafinder.AbstractBasePlaywrightIT]: AbstractBasePlaywrightIT does not declare any static, non-private, non-final, nested classes annotated with @Configuration.
2026-09-21T13:41:33.812Z INFO 230151 --- [Pool-1-worker-2] .b.t.c.SpringBootTestContextBootstrapper : Found @SpringBootConfiguration org.vaadin.addons.dramafinder.tests.TestServer for test class org.vaadin.addons.dramafinder.tests.it.ButtonViewIT
[INFO] Tests run: 33, Failures: 0, Errors: 0, Skipped: 0, Time elapsed: 65.76 s -- in org.vaadin.addons.dramafinder.tests.it.ComboBoxViewIT
[INFO] Running org.vaadin.addons.dramafinder.tests.it.ProgressBarViewIT
2026-09-21T13:41:58.863Z INFO 230151 --- [Pool-1-worker-1] t.c.s.AnnotationConfigContextLoaderUtils : Could not detect default configuration classes for test class [org.vaadin.addons.dramafinder.tests.it.ProgressBarViewIT]: ProgressBarViewIT does not declare any static, non-private, non-final, nested classes annotated with @Configuration.
2026-09-21T13:41:58.864Z INFO 230151 --- [Pool-1-worker-1] .b.t.c.SpringBootTestContextBootstrapper : Found @SpringBootConfiguration org.vaadin.addons.dramafinder.tests.TestServer for test class org.vaadin.addons.dramafinder.tests.it.ProgressBarViewIT
2026-09-21T13:41:58.865Z INFO 230151 --- [Pool-1-worker-1] t.c.s.AnnotationConfigContextLoaderUtils : Could not detect default configuration classes for test class [org.vaadin.addons.dramafinder.tests.it.ProgressBarViewIT]: ProgressBarViewIT does not declare any static, non-private, non-final, nested classes annotated with @Configuration.
2026-09-21T13:41:58.865Z INFO 230151 --- [Pool-1-worker-1] t.c.s.AnnotationConfigContextLoaderUtils : Could not detect default configuration classes for test class [org.vaadin.addons.dramafinder.tests.it.SpringPlaywrightIT]: SpringPlaywrightIT does not declare any static, non-private, non-final, nested classes annotated with @Configuration.
2026-09-21T13:41:58.865Z INFO 230151 --- [Pool-1-worker-1] t.c.s.AnnotationConfigContextLoaderUtils : Could not detect default configuration classes for test class [org.vaadin.addons.dramafinder.AbstractBasePlaywrightIT]: AbstractBasePlaywrightIT does not declare any static, non-private, non-final, nested classes annotated with @Configuration.
2026-09-21T13:41:58.866Z INFO 230151 --- [Pool-1-worker-1] .b.t.c.SpringBootTestContextBootstrapper : Found @SpringBootConfiguration org.vaadin.addons.dramafinder.tests.TestServer for test class org.vaadin.addons.dramafinder.tests.it.ProgressBarViewIT
[ERROR] Tests run: 13, Failures: 1, Errors: 0, Skipped: 0, Time elapsed: 27.86 s <<< FAILURE! -- in org.vaadin.addons.dramafinder.tests.it.ButtonViewIT
[ERROR] org.vaadin.addons.dramafinder.tests.it.ButtonViewIT.testHasThemeVariant -- Time elapsed: 6.549 s <<< FAILURE!
org.opentest4j.AssertionFailedError:
Locator expected to have attribute 'theme'
Expected: small primary
Received: primary small
Call log:
- Assert "hasAttribute" with timeout 5000ms
- waiting for getByRole(AriaRole.BUTTON, new Page.GetByRoleOptions().setName("Combined Variants Button")).and(locator("vaadin-button"))
8 × locator resolved to Combined Variants Button
- unexpected value "primary small"
at com.microsoft.playwright.impl.AssertionsBase.expectImpl(AssertionsBase.java:74)
at com.microsoft.playwright.impl.AssertionsBase.expectImpl(AssertionsBase.java:47)
at com.microsoft.playwright.impl.AssertionsBase.expectImpl(AssertionsBase.java:39)
at com.microsoft.playwright.impl.LocatorAssertionsImpl.hasAttribute(LocatorAssertionsImpl.java:190)
at com.microsoft.playwright.impl.LocatorAssertionsImpl.hasAttribute(LocatorAssertionsImpl.java:170)
at com.microsoft.playwright.assertions.LocatorAssertions.hasAttribute(LocatorAssertions.java:1513)
at org.vaadin.addons.dramafinder.element.shared.HasThemeElement.assertTheme(HasThemeElement.java:26)
at org.vaadin.addons.dramafinder.tests.it.ButtonViewIT.testHasThemeVariant(ButtonViewIT.java:50)
[INFO] Running org.vaadin.addons.dramafinder.tests.it.LoginOverlayViewIT
2026-09-21T13:42:01.668Z INFO 230151 --- [Pool-1-worker-2] t.c.s.AnnotationConfigContextLoaderUtils : Could not detect default configuration classes for test class [org.vaadin.addons.dramafinder.tests.it.LoginOverlayViewIT]: LoginOverlayViewIT does not declare any static, non-private, non-final, nested classes annotated with @Configuration.
2026-09-21T13:42:01.672Z INFO 230151 --- [Pool-1-worker-2] .b.t.c.SpringBootTestContextBootstrapper : Found @SpringBootConfiguration org.vaadin.addons.dramafinder.tests.TestServer for test class org.vaadin.addons.dramafinder.tests.it.LoginOverlayViewIT
2026-09-21T13:42:01.676Z INFO 230151 --- [Pool-1-worker-2] t.c.s.AnnotationConfigContextLoaderUtils : Could not detect default configuration classes for test class [org.vaadin.addons.dramafinder.tests.it.LoginOverlayViewIT]: LoginOverlayViewIT does not declare any static, non-private, non-final, nested classes annotated with @Configuration.
2026-09-21T13:42:01.677Z INFO 230151 --- [Pool-1-worker-2] t.c.s.AnnotationConfigContextLoaderUtils : Could not detect default configuration classes for test class [org.vaadin.addons.dramafinder.tests.it.SpringPlaywrightIT]: SpringPlaywrightIT does not declare any static, non-private, non-final, nested classes annotated with @Configuration.
2026-09-21T13:42:01.677Z INFO 230151 --- [Pool-1-worker-2] t.c.s.AnnotationConfigContextLoaderUtils : Could not detect default configuration classes for test class [org.vaadin.addons.dramafinder.AbstractBasePlaywrightIT]: AbstractBasePlaywrightIT does not declare any static, non-private, non-final, nested classes annotated with @Configuration.
2026-09-21T13:42:01.688Z INFO 230151 --- [Pool-1-worker-2] .b.t.c.SpringBootTestContextBootstrapper : Found @SpringBootConfiguration org.vaadin.addons.dramafinder.tests.TestServer for test class org.vaadin.addons.dramafinder.tests.it.LoginOverlayViewIT
[INFO] Tests run: 4, Failures: 0, Errors: 0, Skipped: 0, Time elapsed: 6.790 s -- in org.vaadin.addons.dramafinder.tests.it.ProgressBarViewIT
[INFO] Running org.vaadin.addons.dramafinder.tests.it.NotificationViewIT
2026-09-21T13:42:05.648Z INFO 230151 --- [Pool-1-worker-1] t.c.s.AnnotationConfigContextLoaderUtils : Could not detect default configuration classes for test class [org.vaadin.addons.dramafinder.tests.it.NotificationViewIT]: NotificationViewIT does not declare any static, non-private, non-final, nested classes annotated with @Configuration.
2026-09-21T13:42:05.649Z INFO 230151 --- [Pool-1-worker-1] .b.t.c.SpringBootTestContextBootstrapper : Found @SpringBootConfiguration org.vaadin.addons.dramafinder.tests.TestServer for test class org.vaadin.addons.dramafinder.tests.it.NotificationViewIT
2026-09-21T13:42:05.650Z INFO 230151 --- [Pool-1-worker-1] t.c.s.AnnotationConfigContextLoaderUtils : Could not detect default configuration classes for test class [org.vaadin.addons.dramafinder.tests.it.NotificationViewIT]: NotificationViewIT does not declare any static, non-private, non-final, nested classes annotated with @Configuration.
2026-09-21T13:42:05.650Z INFO 230151 --- [Pool-1-worker-1] t.c.s.AnnotationConfigContextLoaderUtils : Could not detect default configuration classes for test class [org.vaadin.addons.dramafinder.tests.it.SpringPlaywrightIT]: SpringPlaywrightIT does not declare any static, non-private, non-final, nested classes annotated with @Configuration.
2026-09-21T13:42:05.650Z INFO 230151 --- [Pool-1-worker-1] t.c.s.AnnotationConfigContextLoaderUtils : Could not detect default configuration classes for test class [org.vaadin.addons.dramafinder.AbstractBasePlaywrightIT]: AbstractBasePlaywrightIT does not declare any static, non-private, non-final, nested classes annotated with @Configuration.
2026-09-21T13:42:05.650Z INFO 230151 --- [Pool-1-worker-1] .b.t.c.SpringBootTestContextBootstrapper : Found @SpringBootConfiguration org.vaadin.addons.dramafinder.tests.TestServer for test class org.vaadin.addons.dramafinder.tests.it.NotificationViewIT
[INFO] Tests run: 17, Failures: 0, Errors: 0, Skipped: 0, Time elapsed: 48.33 s -- in org.vaadin.addons.dramafinder.tests.it.TreeGridMultiSelectViewIT
[INFO] Running org.vaadin.addons.dramafinder.tests.it.DateTimePickerViewIT
2026-09-21T13:42:11.821Z INFO 230151 --- [Pool-1-worker-3] t.c.s.AnnotationConfigContextLoaderUtils : Could not detect default configuration classes for test class [org.vaadin.addons.dramafinder.tests.it.DateTimePickerViewIT]: DateTimePickerViewIT does not declare any static, non-private, non-final, nested classes annotated with @Configuration.
2026-09-21T13:42:11.822Z INFO 230151 --- [Pool-1-worker-3] .b.t.c.SpringBootTestContextBootstrapper : Found @SpringBootConfiguration org.vaadin.addons.dramafinder.tests.TestServer for test class org.vaadin.addons.dramafinder.tests.it.DateTimePickerViewIT
2026-09-21T13:42:11.831Z INFO 230151 --- [Pool-1-worker-3] t.c.s.AnnotationConfigContextLoaderUtils : Could not detect default configuration classes for test class [org.vaadin.addons.dramafinder.tests.it.DateTimePickerViewIT]: DateTimePickerViewIT does not declare any static, non-private, non-final, nested classes annotated with @Configuration.
2026-09-21T13:42:11.832Z INFO 230151 --- [Pool-1-worker-3] t.c.s.AnnotationConfigContextLoaderUtils : Could not detect default configuration classes for test class [org.vaadin.addons.dramafinder.tests.it.SpringPlaywrightIT]: SpringPlaywrightIT does not declare any static, non-private, non-final, nested classes annotated with @Configuration.
2026-09-21T13:42:11.832Z INFO 230151 --- [Pool-1-worker-3] t.c.s.AnnotationConfigContextLoaderUtils : Could not detect default configuration classes for test class [org.vaadin.addons.dramafinder.AbstractBasePlaywrightIT]: AbstractBasePlaywrightIT does not declare any static, non-private, non-final, nested classes annotated with @Configuration.
2026-09-21T13:42:11.835Z INFO 230151 --- [Pool-1-worker-3] .b.t.c.SpringBootTestContextBootstrapper : Found @SpringBootConfiguration org.vaadin.addons.dramafinder.tests.TestServer for test class org.vaadin.addons.dramafinder.tests.it.DateTimePickerViewIT
[INFO] Tests run: 5, Failures: 0, Errors: 0, Skipped: 0, Time elapsed: 15.08 s -- in org.vaadin.addons.dramafinder.tests.it.LoginOverlayViewIT
[INFO] Running org.vaadin.addons.dramafinder.tests.it.VirtualListViewIT
2026-09-21T13:42:16.743Z INFO 230151 --- [Pool-1-worker-2] t.c.s.AnnotationConfigContextLoaderUtils : Could not detect default configuration classes for test class [org.vaadin.addons.dramafinder.tests.it.VirtualListViewIT]: VirtualListViewIT does not declare any static, non-private, non-final, nested classes annotated with @Configuration.
2026-09-21T13:42:16.744Z INFO 230151 --- [Pool-1-worker-2] .b.t.c.SpringBootTestContextBootstrapper : Found @SpringBootConfiguration org.vaadin.addons.dramafinder.tests.TestServer for test class org.vaadin.addons.dramafinder.tests.it.VirtualListViewIT
2026-09-21T13:42:16.758Z INFO 230151 --- [Pool-1-worker-2] t.c.s.AnnotationConfigContextLoaderUtils : Could not detect default configuration classes for test class [org.vaadin.addons.dramafinder.tests.it.VirtualListViewIT]: VirtualListViewIT does not declare any static, non-private, non-final, nested classes annotated with @Configuration.
2026-09-21T13:42:16.758Z INFO 230151 --- [Pool-1-worker-2] t.c.s.AnnotationConfigContextLoaderUtils : Could not detect default configuration classes for test class [org.vaadin.addons.dramafinder.tests.it.SpringPlaywrightIT]: SpringPlaywrightIT does not declare any static, non-private, non-final, nested classes annotated with @Configuration.
2026-09-21T13:42:16.758Z INFO 230151 --- [Pool-1-worker-2] t.c.s.AnnotationConfigContextLoaderUtils : Could not detect default configuration classes for test class [org.vaadin.addons.dramafinder.AbstractBasePlaywrightIT]: AbstractBasePlaywrightIT does not declare any static, non-private, non-final, nested classes annotated with @Configuration.
2026-09-21T13:42:16.759Z INFO 230151 --- [Pool-1-worker-2] .b.t.c.SpringBootTestContextBootstrapper : Found @SpringBootConfiguration org.vaadin.addons.dramafinder.tests.TestServer for test class org.vaadin.addons.dramafinder.tests.it.VirtualListViewIT
[INFO] Tests run: 6, Failures: 0, Errors: 0, Skipped: 0, Time elapsed: 13.02 s -- in org.vaadin.addons.dramafinder.tests.it.NotificationViewIT
[INFO] Running org.vaadin.addons.dramafinder.tests.it.PasswordFieldGetByLabelIT
2026-09-21T13:42:18.673Z INFO 230151 --- [Pool-1-worker-1] t.c.s.AnnotationConfigContextLoaderUtils : Could not detect default configuration classes for test class [org.vaadin.addons.dramafinder.tests.it.PasswordFieldGetByLabelIT]: PasswordFieldGetByLabelIT does not declare any static, non-private, non-final, nested classes annotated with @Configuration.
2026-09-21T13:42:18.674Z INFO 230151 --- [Pool-1-worker-1] .b.t.c.SpringBootTestContextBootstrapper : Found @SpringBootConfiguration org.vaadin.addons.dramafinder.tests.TestServer for test class org.vaadin.addons.dramafinder.tests.it.PasswordFieldGetByLabelIT
2026-09-21T13:42:18.680Z INFO 230151 --- [Pool-1-worker-1] t.c.s.AnnotationConfigContextLoaderUtils : Could not detect default configuration classes for test class [org.vaadin.addons.dramafinder.tests.it.PasswordFieldGetByLabelIT]: PasswordFieldGetByLabelIT does not declare any static, non-private, non-final, nested classes annotated with @Configuration.
2026-09-21T13:42:18.680Z INFO 230151 --- [Pool-1-worker-1] t.c.s.AnnotationConfigContextLoaderUtils : Could not detect default configuration classes for test class [org.vaadin.addons.dramafinder.tests.it.SpringPlaywrightIT]: SpringPlaywrightIT does not declare any static, non-private, non-final, nested classes annotated with @Configuration.
2026-09-21T13:42:18.680Z INFO 230151 --- [Pool-1-worker-1] t.c.s.AnnotationConfigContextLoaderUtils : Could not detect default configuration classes for test class [org.vaadin.addons.dramafinder.AbstractBasePlaywrightIT]: AbstractBasePlaywrightIT does not declare any static, non-private, non-final, nested classes annotated with @Configuration.
2026-09-21T13:42:18.681Z INFO 230151 --- [Pool-1-worker-1] .b.t.c.SpringBootTestContextBootstrapper : Found @SpringBootConfiguration org.vaadin.addons.dramafinder.tests.TestServer for test class org.vaadin.addons.dramafinder.tests.it.PasswordFieldGetByLabelIT
[INFO] Tests run: 2, Failures: 0, Errors: 0, Skipped: 0, Time elapsed: 4.333 s -- in org.vaadin.addons.dramafinder.tests.it.PasswordFieldGetByLabelIT
[INFO] Running org.vaadin.addons.dramafinder.tests.it.UploadViewIT
2026-09-21T13:42:23.013Z INFO 230151 --- [Pool-1-worker-1] t.c.s.AnnotationConfigContextLoaderUtils : Could not detect default configuration classes for test class [org.vaadin.addons.dramafinder.tests.it.UploadViewIT]: UploadViewIT does not declare any static, non-private, non-final, nested classes annotated with @Configuration.
2026-09-21T13:42:23.015Z INFO 230151 --- [Pool-1-worker-1] .b.t.c.SpringBootTestContextBootstrapper : Found @SpringBootConfiguration org.vaadin.addons.dramafinder.tests.TestServer for test class org.vaadin.addons.dramafinder.tests.it.UploadViewIT
2026-09-21T13:42:23.016Z INFO 230151 --- [Pool-1-worker-1] t.c.s.AnnotationConfigContextLoaderUtils : Could not detect default configuration classes for test class [org.vaadin.addons.dramafinder.tests.it.UploadViewIT]: UploadViewIT does not declare any static, non-private, non-final, nested classes annotated with @Configuration.
2026-09-21T13:42:23.017Z INFO 230151 --- [Pool-1-worker-1] t.c.s.AnnotationConfigContextLoaderUtils : Could not detect default configuration classes for test class [org.vaadin.addons.dramafinder.tests.it.SpringPlaywrightIT]: SpringPlaywrightIT does not declare any static, non-private, non-final, nested classes annotated with @Configuration.
2026-09-21T13:42:23.017Z INFO 230151 --- [Pool-1-worker-1] t.c.s.AnnotationConfigContextLoaderUtils : Could not detect default configuration classes for test class [org.vaadin.addons.dramafinder.AbstractBasePlaywrightIT]: AbstractBasePlaywrightIT does not declare any static, non-private, non-final, nested classes annotated with @Configuration.
2026-09-21T13:42:23.020Z INFO 230151 --- [Pool-1-worker-1] .b.t.c.SpringBootTestContextBootstrapper : Found @SpringBootConfiguration org.vaadin.addons.dramafinder.tests.TestServer for test class org.vaadin.addons.dramafinder.tests.it.UploadViewIT
[INFO] Tests run: 3, Failures: 0, Errors: 0, Skipped: 0, Time elapsed: 6.196 s -- in org.vaadin.addons.dramafinder.tests.it.UploadViewIT
[INFO] Running org.vaadin.addons.dramafinder.tests.it.CheckboxViewIT
2026-09-21T13:42:29.219Z INFO 230151 --- [Pool-1-worker-1] t.c.s.AnnotationConfigContextLoaderUtils : Could not detect default configuration classes for test class [org.vaadin.addons.dramafinder.tests.it.CheckboxViewIT]: CheckboxViewIT does not declare any static, non-private, non-final, nested classes annotated with @Configuration.
2026-09-21T13:42:29.220Z INFO 230151 --- [Pool-1-worker-1] .b.t.c.SpringBootTestContextBootstrapper : Found @SpringBootConfiguration org.vaadin.addons.dramafinder.tests.TestServer for test class org.vaadin.addons.dramafinder.tests.it.CheckboxViewIT
2026-09-21T13:42:29.221Z INFO 230151 --- [Pool-1-worker-1] t.c.s.AnnotationConfigContextLoaderUtils : Could not detect default configuration classes for test class [org.vaadin.addons.dramafinder.tests.it.CheckboxViewIT]: CheckboxViewIT does not declare any static, non-private, non-final, nested classes annotated with @Configuration.
2026-09-21T13:42:29.221Z INFO 230151 --- [Pool-1-worker-1] t.c.s.AnnotationConfigContextLoaderUtils : Could not detect default configuration classes for test class [org.vaadin.addons.dramafinder.tests.it.SpringPlaywrightIT]: SpringPlaywrightIT does not declare any static, non-private, non-final, nested classes annotated with @Configuration.
2026-09-21T13:42:29.221Z INFO 230151 --- [Pool-1-worker-1] t.c.s.AnnotationConfigContextLoaderUtils : Could not detect default configuration classes for test class [org.vaadin.addons.dramafinder.AbstractBasePlaywrightIT]: AbstractBasePlaywrightIT does not declare any static, non-private, non-final, nested classes annotated with @Configuration.
2026-09-21T13:42:29.222Z INFO 230151 --- [Pool-1-worker-1] .b.t.c.SpringBootTestContextBootstrapper : Found @SpringBootConfiguration org.vaadin.addons.dramafinder.tests.TestServer for test class org.vaadin.addons.dramafinder.tests.it.CheckboxViewIT
[INFO] Tests run: 10, Failures: 0, Errors: 0, Skipped: 0, Time elapsed: 20.67 s -- in org.vaadin.addons.dramafinder.tests.it.DateTimePickerViewIT
[INFO] Running org.vaadin.addons.dramafinder.tests.it.GridDetailsViewIT
2026-09-21T13:42:32.492Z INFO 230151 --- [Pool-1-worker-3] t.c.s.AnnotationConfigContextLoaderUtils : Could not detect default configuration classes for test class [org.vaadin.addons.dramafinder.tests.it.GridDetailsViewIT]: GridDetailsViewIT does not declare any static, non-private, non-final, nested classes annotated with @Configuration.
2026-09-21T13:42:32.496Z INFO 230151 --- [Pool-1-worker-3] .b.t.c.SpringBootTestContextBootstrapper : Found @SpringBootConfiguration org.vaadin.addons.dramafinder.tests.TestServer for test class org.vaadin.addons.dramafinder.tests.it.GridDetailsViewIT
2026-09-21T13:42:32.500Z INFO 230151 --- [Pool-1-worker-3] t.c.s.AnnotationConfigContextLoaderUtils : Could not detect default configuration classes for test class [org.vaadin.addons.dramafinder.tests.it.GridDetailsViewIT]: GridDetailsViewIT does not declare any static, non-private, non-final, nested classes annotated with @Configuration.
2026-09-21T13:42:32.500Z INFO 230151 --- [Pool-1-worker-3] t.c.s.AnnotationConfigContextLoaderUtils : Could not detect default configuration classes for test class [org.vaadin.addons.dramafinder.tests.it.SpringPlaywrightIT]: SpringPlaywrightIT does not declare any static, non-private, non-final, nested classes annotated with @Configuration.
2026-09-21T13:42:32.501Z INFO 230151 --- [Pool-1-worker-3] t.c.s.AnnotationConfigContextLoaderUtils : Could not detect default configuration classes for test class [org.vaadin.addons.dramafinder.AbstractBasePlaywrightIT]: AbstractBasePlaywrightIT does not declare any static, non-private, non-final, nested classes annotated with @Configuration.
2026-09-21T13:42:32.501Z INFO 230151 --- [Pool-1-worker-3] .b.t.c.SpringBootTestContextBootstrapper : Found @SpringBootConfiguration org.vaadin.addons.dramafinder.tests.TestServer for test class org.vaadin.addons.dramafinder.tests.it.GridDetailsViewIT
[INFO] Tests run: 5, Failures: 0, Errors: 0, Skipped: 0, Time elapsed: 10.28 s -- in org.vaadin.addons.dramafinder.tests.it.GridDetailsViewIT
[INFO] Running org.vaadin.addons.dramafinder.tests.it.AccordionViewIT
2026-09-21T13:42:42.773Z INFO 230151 --- [Pool-1-worker-3] t.c.s.AnnotationConfigContextLoaderUtils : Could not detect default configuration classes for test class [org.vaadin.addons.dramafinder.tests.it.AccordionViewIT]: AccordionViewIT does not declare any static, non-private, non-final, nested classes annotated with @Configuration.
2026-09-21T13:42:42.784Z INFO 230151 --- [Pool-1-worker-3] .b.t.c.SpringBootTestContextBootstrapper : Found @SpringBootConfiguration org.vaadin.addons.dramafinder.tests.TestServer for test class org.vaadin.addons.dramafinder.tests.it.AccordionViewIT
2026-09-21T13:42:42.785Z INFO 230151 --- [Pool-1-worker-3] t.c.s.AnnotationConfigContextLoaderUtils : Could not detect default configuration classes for test class [org.vaadin.addons.dramafinder.tests.it.AccordionViewIT]: AccordionViewIT does not declare any static, non-private, non-final, nested classes annotated with @Configuration.
2026-09-21T13:42:42.785Z INFO 230151 --- [Pool-1-worker-3] t.c.s.AnnotationConfigContextLoaderUtils : Could not detect default configuration classes for test class [org.vaadin.addons.dramafinder.tests.it.SpringPlaywrightIT]: SpringPlaywrightIT does not declare any static, non-private, non-final, nested classes annotated with @Configuration.
2026-09-21T13:42:42.789Z INFO 230151 --- [Pool-1-worker-3] t.c.s.AnnotationConfigContextLoaderUtils : Could not detect default configuration classes for test class [org.vaadin.addons.dramafinder.AbstractBasePlaywrightIT]: AbstractBasePlaywrightIT does not declare any static, non-private, non-final, nested classes annotated with @Configuration.
2026-09-21T13:42:42.793Z INFO 230151 --- [Pool-1-worker-3] .b.t.c.SpringBootTestContextBootstrapper : Found @SpringBootConfiguration org.vaadin.addons.dramafinder.tests.TestServer for test class org.vaadin.addons.dramafinder.tests.it.AccordionViewIT
[INFO] Tests run: 11, Failures: 0, Errors: 0, Skipped: 0, Time elapsed: 18.89 s -- in org.vaadin.addons.dramafinder.tests.it.CheckboxViewIT
[INFO] Running org.vaadin.addons.dramafinder.tests.it.TextFieldViewIT
2026-09-21T13:42:48.103Z INFO 230151 --- [Pool-1-worker-1] t.c.s.AnnotationConfigContextLoaderUtils : Could not detect default configuration classes for test class [org.vaadin.addons.dramafinder.tests.it.TextFieldViewIT]: TextFieldViewIT does not declare any static, non-private, non-final, nested classes annotated with @Configuration.
2026-09-21T13:42:48.105Z INFO 230151 --- [Pool-1-worker-1] .b.t.c.SpringBootTestContextBootstrapper : Found @SpringBootConfiguration org.vaadin.addons.dramafinder.tests.TestServer for test class org.vaadin.addons.dramafinder.tests.it.TextFieldViewIT
2026-09-21T13:42:48.107Z INFO 230151 --- [Pool-1-worker-1] t.c.s.AnnotationConfigContextLoaderUtils : Could not detect default configuration classes for test class [org.vaadin.addons.dramafinder.tests.it.TextFieldViewIT]: TextFieldViewIT does not declare any static, non-private, non-final, nested classes annotated with @Configuration.
2026-09-21T13:42:48.107Z INFO 230151 --- [Pool-1-worker-1] t.c.s.AnnotationConfigContextLoaderUtils : Could not detect default configuration classes for test class [org.vaadin.addons.dramafinder.tests.it.SpringPlaywrightIT]: SpringPlaywrightIT does not declare any static, non-private, non-final, nested classes annotated with @Configuration.
2026-09-21T13:42:48.107Z INFO 230151 --- [Pool-1-worker-1] t.c.s.AnnotationConfigContextLoaderUtils : Could not detect default configuration classes for test class [org.vaadin.addons.dramafinder.AbstractBasePlaywrightIT]: AbstractBasePlaywrightIT does not declare any static, non-private, non-final, nested classes annotated with @Configuration.
2026-09-21T13:42:48.108Z INFO 230151 --- [Pool-1-worker-1] .b.t.c.SpringBootTestContextBootstrapper : Found @SpringBootConfiguration org.vaadin.addons.dramafinder.tests.TestServer for test class org.vaadin.addons.dramafinder.tests.it.TextFieldViewIT
[INFO] Tests run: 3, Failures: 0, Errors: 0, Skipped: 0, Time elapsed: 7.029 s -- in org.vaadin.addons.dramafinder.tests.it.AccordionViewIT
[INFO] Running org.vaadin.addons.dramafinder.tests.it.MarkdownViewIT
2026-09-21T13:42:49.802Z INFO 230151 --- [Pool-1-worker-3] t.c.s.AnnotationConfigContextLoaderUtils : Could not detect default configuration classes for test class [org.vaadin.addons.dramafinder.tests.it.MarkdownViewIT]: MarkdownViewIT does not declare any static, non-private, non-final, nested classes annotated with @Configuration.
2026-09-21T13:42:49.808Z INFO 230151 --- [Pool-1-worker-3] .b.t.c.SpringBootTestContextBootstrapper : Found @SpringBootConfiguration org.vaadin.addons.dramafinder.tests.TestServer for test class org.vaadin.addons.dramafinder.tests.it.MarkdownViewIT
2026-09-21T13:42:49.810Z INFO 230151 --- [Pool-1-worker-3] t.c.s.AnnotationConfigContextLoaderUtils : Could not detect default configuration classes for test class [org.vaadin.addons.dramafinder.tests.it.MarkdownViewIT]: MarkdownViewIT does not declare any static, non-private, non-final, nested classes annotated with @Configuration.
2026-09-21T13:42:49.810Z INFO 230151 --- [Pool-1-worker-3] t.c.s.AnnotationConfigContextLoaderUtils : Could not detect default configuration classes for test class [org.vaadin.addons.dramafinder.tests.it.SpringPlaywrightIT]: SpringPlaywrightIT does not declare any static, non-private, non-final, nested classes annotated with @Configuration.
2026-09-21T13:42:49.811Z INFO 230151 --- [Pool-1-worker-3] t.c.s.AnnotationConfigContextLoaderUtils : Could not detect default configuration classes for test class [org.vaadin.addons.dramafinder.AbstractBasePlaywrightIT]: AbstractBasePlaywrightIT does not declare any static, non-private, non-final, nested classes annotated with @Configuration.
2026-09-21T13:42:49.811Z INFO 230151 --- [Pool-1-worker-3] .b.t.c.SpringBootTestContextBootstrapper : Found @SpringBootConfiguration org.vaadin.addons.dramafinder.tests.TestServer for test class org.vaadin.addons.dramafinder.tests.it.MarkdownViewIT
[INFO] Tests run: 21, Failures: 0, Errors: 0, Skipped: 0, Time elapsed: 37.15 s -- in org.vaadin.addons.dramafinder.tests.it.VirtualListViewIT
[INFO] Running org.vaadin.addons.dramafinder.tests.it.CardViewIT
2026-09-21T13:42:53.891Z INFO 230151 --- [Pool-1-worker-2] t.c.s.AnnotationConfigContextLoaderUtils : Could not detect default configuration classes for test class [org.vaadin.addons.dramafinder.tests.it.CardViewIT]: CardViewIT does not declare any static, non-private, non-final, nested classes annotated with @Configuration.
2026-09-21T13:42:53.900Z INFO 230151 --- [Pool-1-worker-2] .b.t.c.SpringBootTestContextBootstrapper : Found @SpringBootConfiguration org.vaadin.addons.dramafinder.tests.TestServer for test class org.vaadin.addons.dramafinder.tests.it.CardViewIT
2026-09-21T13:42:53.901Z INFO 230151 --- [Pool-1-worker-2] t.c.s.AnnotationConfigContextLoaderUtils : Could not detect default configuration classes for test class [org.vaadin.addons.dramafinder.tests.it.CardViewIT]: CardViewIT does not declare any static, non-private, non-final, nested classes annotated with @Configuration.
2026-09-21T13:42:53.901Z INFO 230151 --- [Pool-1-worker-2] t.c.s.AnnotationConfigContextLoaderUtils : Could not detect default configuration classes for test class [org.vaadin.addons.dramafinder.tests.it.SpringPlaywrightIT]: SpringPlaywrightIT does not declare any static, non-private, non-final, nested classes annotated with @Configuration.
2026-09-21T13:42:53.902Z INFO 230151 --- [Pool-1-worker-2] t.c.s.AnnotationConfigContextLoaderUtils : Could not detect default configuration classes for test class [org.vaadin.addons.dramafinder.AbstractBasePlaywrightIT]: AbstractBasePlaywrightIT does not declare any static, non-private, non-final, nested classes annotated with @Configuration.
2026-09-21T13:42:53.902Z INFO 230151 --- [Pool-1-worker-2] .b.t.c.SpringBootTestContextBootstrapper : Found @SpringBootConfiguration org.vaadin.addons.dramafinder.tests.TestServer for test class org.vaadin.addons.dramafinder.tests.it.CardViewIT
[INFO] Tests run: 2, Failures: 0, Errors: 0, Skipped: 0, Time elapsed: 4.300 s -- in org.vaadin.addons.dramafinder.tests.it.CardViewIT
[INFO] Running org.vaadin.addons.dramafinder.tests.it.EmailFieldGetByLabelIT
2026-09-21T13:42:58.204Z INFO 230151 --- [Pool-1-worker-2] t.c.s.AnnotationConfigContextLoaderUtils : Could not detect default configuration classes for test class [org.vaadin.addons.dramafinder.tests.it.EmailFieldGetByLabelIT]: EmailFieldGetByLabelIT does not declare any static, non-private, non-final, nested classes annotated with @Configuration.
2026-09-21T13:42:58.206Z INFO 230151 --- [Pool-1-worker-2] .b.t.c.SpringBootTestContextBootstrapper : Found @SpringBootConfiguration org.vaadin.addons.dramafinder.tests.TestServer for test class org.vaadin.addons.dramafinder.tests.it.EmailFieldGetByLabelIT
2026-09-21T13:42:58.209Z INFO 230151 --- [Pool-1-worker-2] t.c.s.AnnotationConfigContextLoaderUtils : Could not detect default configuration classes for test class [org.vaadin.addons.dramafinder.tests.it.EmailFieldGetByLabelIT]: EmailFieldGetByLabelIT does not declare any static, non-private, non-final, nested classes annotated with @Configuration.
2026-09-21T13:42:58.209Z INFO 230151 --- [Pool-1-worker-2] t.c.s.AnnotationConfigContextLoaderUtils : Could not detect default configuration classes for test class [org.vaadin.addons.dramafinder.tests.it.SpringPlaywrightIT]: SpringPlaywrightIT does not declare any static, non-private, non-final, nested classes annotated with @Configuration.
2026-09-21T13:42:58.209Z INFO 230151 --- [Pool-1-worker-2] t.c.s.AnnotationConfigContextLoaderUtils : Could not detect default configuration classes for test class [org.vaadin.addons.dramafinder.AbstractBasePlaywrightIT]: AbstractBasePlaywrightIT does not declare any static, non-private, non-final, nested classes annotated with @Configuration.
2026-09-21T13:42:58.211Z INFO 230151 --- [Pool-1-worker-2] .b.t.c.SpringBootTestContextBootstrapper : Found @SpringBootConfiguration org.vaadin.addons.dramafinder.tests.TestServer for test class org.vaadin.addons.dramafinder.tests.it.EmailFieldGetByLabelIT
[INFO] Tests run: 3, Failures: 0, Errors: 0, Skipped: 0, Time elapsed: 6.676 s -- in org.vaadin.addons.dramafinder.tests.it.EmailFieldGetByLabelIT
[INFO] Running org.vaadin.addons.dramafinder.tests.it.TextAreaViewIT
2026-09-21T13:43:04.872Z INFO 230151 --- [Pool-1-worker-2] t.c.s.AnnotationConfigContextLoaderUtils : Could not detect default configuration classes for test class [org.vaadin.addons.dramafinder.tests.it.TextAreaViewIT]: TextAreaViewIT does not declare any static, non-private, non-final, nested classes annotated with @Configuration.
2026-09-21T13:43:04.873Z INFO 230151 --- [Pool-1-worker-2] .b.t.c.SpringBootTestContextBootstrapper : Found @SpringBootConfiguration org.vaadin.addons.dramafinder.tests.TestServer for test class org.vaadin.addons.dramafinder.tests.it.TextAreaViewIT
2026-09-21T13:43:04.874Z INFO 230151 --- [Pool-1-worker-2] t.c.s.AnnotationConfigContextLoaderUtils : Could not detect default configuration classes for test class [org.vaadin.addons.dramafinder.tests.it.TextAreaViewIT]: TextAreaViewIT does not declare any static, non-private, non-final, nested classes annotated with @Configuration.
2026-09-21T13:43:04.876Z INFO 230151 --- [Pool-1-worker-2] t.c.s.AnnotationConfigContextLoaderUtils : Could not detect default configuration classes for test class [org.vaadin.addons.dramafinder.tests.it.SpringPlaywrightIT]: SpringPlaywrightIT does not declare any static, non-private, non-final, nested classes annotated with @Configuration.
2026-09-21T13:43:04.876Z INFO 230151 --- [Pool-1-worker-2] t.c.s.AnnotationConfigContextLoaderUtils : Could not detect default configuration classes for test class [org.vaadin.addons.dramafinder.AbstractBasePlaywrightIT]: AbstractBasePlaywrightIT does not declare any static, non-private, non-final, nested classes annotated with @Configuration.
2026-09-21T13:43:04.876Z INFO 230151 --- [Pool-1-worker-2] .b.t.c.SpringBootTestContextBootstrapper : Found @SpringBootConfiguration org.vaadin.addons.dramafinder.tests.TestServer for test class org.vaadin.addons.dramafinder.tests.it.TextAreaViewIT
[INFO] Tests run: 9, Failures: 0, Errors: 0, Skipped: 0, Time elapsed: 15.26 s -- in org.vaadin.addons.dramafinder.tests.it.MarkdownViewIT
[INFO] Running org.vaadin.addons.dramafinder.tests.it.SelectGetByLabelIT
2026-09-21T13:43:05.060Z INFO 230151 --- [Pool-1-worker-3] t.c.s.AnnotationConfigContextLoaderUtils : Could not detect default configuration classes for test class [org.vaadin.addons.dramafinder.tests.it.SelectGetByLabelIT]: SelectGetByLabelIT does not declare any static, non-private, non-final, nested classes annotated with @Configuration.
2026-09-21T13:43:05.067Z INFO 230151 --- [Pool-1-worker-3] .b.t.c.SpringBootTestContextBootstrapper : Found @SpringBootConfiguration org.vaadin.addons.dramafinder.tests.TestServer for test class org.vaadin.addons.dramafinder.tests.it.SelectGetByLabelIT
2026-09-21T13:43:05.068Z INFO 230151 --- [Pool-1-worker-3] t.c.s.AnnotationConfigContextLoaderUtils : Could not detect default configuration classes for test class [org.vaadin.addons.dramafinder.tests.it.SelectGetByLabelIT]: SelectGetByLabelIT does not declare any static, non-private, non-final, nested classes annotated with @Configuration.
2026-09-21T13:43:05.068Z INFO 230151 --- [Pool-1-worker-3] t.c.s.AnnotationConfigContextLoaderUtils : Could not detect default configuration classes for test class [org.vaadin.addons.dramafinder.tests.it.SpringPlaywrightIT]: SpringPlaywrightIT does not declare any static, non-private, non-final, nested classes annotated with @Configuration.
2026-09-21T13:43:05.068Z INFO 230151 --- [Pool-1-worker-3] t.c.s.AnnotationConfigContextLoaderUtils : Could not detect default configuration classes for test class [org.vaadin.addons.dramafinder.AbstractBasePlaywrightIT]: AbstractBasePlaywrightIT does not declare any static, non-private, non-final, nested classes annotated with @Configuration.
2026-09-21T13:43:05.068Z INFO 230151 --- [Pool-1-worker-3] .b.t.c.SpringBootTestContextBootstrapper : Found @SpringBootConfiguration org.vaadin.addons.dramafinder.tests.TestServer for test class org.vaadin.addons.dramafinder.tests.it.SelectGetByLabelIT
[INFO] Tests run: 2, Failures: 0, Errors: 0, Skipped: 0, Time elapsed: 3.895 s -- in org.vaadin.addons.dramafinder.tests.it.SelectGetByLabelIT
[INFO] Running org.vaadin.addons.dramafinder.tests.it.AgentReportingIT
2026-09-21T13:43:08.961Z INFO 230151 --- [Pool-1-worker-3] t.c.s.AnnotationConfigContextLoaderUtils : Could not detect default configuration classes for test class [org.vaadin.addons.dramafinder.tests.it.AgentReportingIT]: AgentReportingIT does not declare any static, non-private, non-final, nested classes annotated with @Configuration.
2026-09-21T13:43:08.965Z INFO 230151 --- [Pool-1-worker-3] .b.t.c.SpringBootTestContextBootstrapper : Found @SpringBootConfiguration org.vaadin.addons.dramafinder.tests.TestServer for test class org.vaadin.addons.dramafinder.tests.it.AgentReportingIT
2026-09-21T13:43:08.967Z INFO 230151 --- [Pool-1-worker-3] t.c.s.AnnotationConfigContextLoaderUtils : Could not detect default configuration classes for test class [org.vaadin.addons.dramafinder.tests.it.AgentReportingIT]: AgentReportingIT does not declare any static, non-private, non-final, nested classes annotated with @Configuration.
2026-09-21T13:43:08.967Z INFO 230151 --- [Pool-1-worker-3] t.c.s.AnnotationConfigContextLoaderUtils : Could not detect default configuration classes for test class [org.vaadin.addons.dramafinder.tests.it.SpringPlaywrightIT]: SpringPlaywrightIT does not declare any static, non-private, non-final, nested classes annotated with @Configuration.
2026-09-21T13:43:08.968Z INFO 230151 --- [Pool-1-worker-3] t.c.s.AnnotationConfigContextLoaderUtils : Could not detect default configuration classes for test class [org.vaadin.addons.dramafinder.AbstractBasePlaywrightIT]: AbstractBasePlaywrightIT does not declare any static, non-private, non-final, nested classes annotated with @Configuration.
2026-09-21T13:43:08.969Z INFO 230151 --- [Pool-1-worker-3] .b.t.c.SpringBootTestContextBootstrapper : Found @SpringBootConfiguration org.vaadin.addons.dramafinder.tests.TestServer for test class org.vaadin.addons.dramafinder.tests.it.AgentReportingIT
[INFO] Tests run: 6, Failures: 0, Errors: 0, Skipped: 0, Time elapsed: 13.02 s -- in org.vaadin.addons.dramafinder.tests.it.AgentReportingIT
[INFO] Running org.vaadin.addons.dramafinder.tests.it.MessageInputViewIT
2026-09-21T13:43:21.972Z INFO 230151 --- [Pool-1-worker-3] t.c.s.AnnotationConfigContextLoaderUtils : Could not detect default configuration classes for test class [org.vaadin.addons.dramafinder.tests.it.MessageInputViewIT]: MessageInputViewIT does not declare any static, non-private, non-final, nested classes annotated with @Configuration.
2026-09-21T13:43:21.979Z INFO 230151 --- [Pool-1-worker-3] .b.t.c.SpringBootTestContextBootstrapper : Found @SpringBootConfiguration org.vaadin.addons.dramafinder.tests.TestServer for test class org.vaadin.addons.dramafinder.tests.it.MessageInputViewIT
2026-09-21T13:43:21.980Z INFO 230151 --- [Pool-1-worker-3] t.c.s.AnnotationConfigContextLoaderUtils : Could not detect default configuration classes for test class [org.vaadin.addons.dramafinder.tests.it.MessageInputViewIT]: MessageInputViewIT does not declare any static, non-private, non-final, nested classes annotated with @Configuration.
2026-09-21T13:43:21.983Z INFO 230151 --- [Pool-1-worker-3] t.c.s.AnnotationConfigContextLoaderUtils : Could not detect default configuration classes for test class [org.vaadin.addons.dramafinder.tests.it.SpringPlaywrightIT]: SpringPlaywrightIT does not declare any static, non-private, non-final, nested classes annotated with @Configuration.
2026-09-21T13:43:21.984Z INFO 230151 --- [Pool-1-worker-3] t.c.s.AnnotationConfigContextLoaderUtils : Could not detect default configuration classes for test class [org.vaadin.addons.dramafinder.AbstractBasePlaywrightIT]: AbstractBasePlaywrightIT does not declare any static, non-private, non-final, nested classes annotated with @Configuration.
2026-09-21T13:43:21.987Z INFO 230151 --- [Pool-1-worker-3] .b.t.c.SpringBootTestContextBootstrapper : Found @SpringBootConfiguration org.vaadin.addons.dramafinder.tests.TestServer for test class org.vaadin.addons.dramafinder.tests.it.MessageInputViewIT
[INFO] Tests run: 24, Failures: 0, Errors: 0, Skipped: 0, Time elapsed: 41.76 s -- in org.vaadin.addons.dramafinder.tests.it.TextFieldViewIT
[INFO] Running org.vaadin.addons.dramafinder.tests.it.ComboBoxGetByLabelIT
2026-09-21T13:43:29.871Z INFO 230151 --- [Pool-1-worker-1] t.c.s.AnnotationConfigContextLoaderUtils : Could not detect default configuration classes for test class [org.vaadin.addons.dramafinder.tests.it.ComboBoxGetByLabelIT]: ComboBoxGetByLabelIT does not declare any static, non-private, non-final, nested classes annotated with @Configuration.
2026-09-21T13:43:29.873Z INFO 230151 --- [Pool-1-worker-1] .b.t.c.SpringBootTestContextBootstrapper : Found @SpringBootConfiguration org.vaadin.addons.dramafinder.tests.TestServer for test class org.vaadin.addons.dramafinder.tests.it.ComboBoxGetByLabelIT
2026-09-21T13:43:29.875Z INFO 230151 --- [Pool-1-worker-1] t.c.s.AnnotationConfigContextLoaderUtils : Could not detect default configuration classes for test class [org.vaadin.addons.dramafinder.tests.it.ComboBoxGetByLabelIT]: ComboBoxGetByLabelIT does not declare any static, non-private, non-final, nested classes annotated with @Configuration.
2026-09-21T13:43:29.875Z INFO 230151 --- [Pool-1-worker-1] t.c.s.AnnotationConfigContextLoaderUtils : Could not detect default configuration classes for test class [org.vaadin.addons.dramafinder.tests.it.SpringPlaywrightIT]: SpringPlaywrightIT does not declare any static, non-private, non-final, nested classes annotated with @Configuration.
2026-09-21T13:43:29.875Z INFO 230151 --- [Pool-1-worker-1] t.c.s.AnnotationConfigContextLoaderUtils : Could not detect default configuration classes for test class [org.vaadin.addons.dramafinder.AbstractBasePlaywrightIT]: AbstractBasePlaywrightIT does not declare any static, non-private, non-final, nested classes annotated with @Configuration.
2026-09-21T13:43:29.875Z INFO 230151 --- [Pool-1-worker-1] .b.t.c.SpringBootTestContextBootstrapper : Found @SpringBootConfiguration org.vaadin.addons.dramafinder.tests.TestServer for test class org.vaadin.addons.dramafinder.tests.it.ComboBoxGetByLabelIT
[INFO] Tests run: 8, Failures: 0, Errors: 0, Skipped: 0, Time elapsed: 12.78 s -- in org.vaadin.addons.dramafinder.tests.it.MessageInputViewIT
[INFO] Running org.vaadin.addons.dramafinder.tests.it.DatePickerGetByLabelIT
2026-09-21T13:43:34.757Z INFO 230151 --- [Pool-1-worker-3] t.c.s.AnnotationConfigContextLoaderUtils : Could not detect default configuration classes for test class [org.vaadin.addons.dramafinder.tests.it.DatePickerGetByLabelIT]: DatePickerGetByLabelIT does not declare any static, non-private, non-final, nested classes annotated with @Configuration.
2026-09-21T13:43:34.759Z INFO 230151 --- [Pool-1-worker-3] .b.t.c.SpringBootTestContextBootstrapper : Found @SpringBootConfiguration org.vaadin.addons.dramafinder.tests.TestServer for test class org.vaadin.addons.dramafinder.tests.it.DatePickerGetByLabelIT
2026-09-21T13:43:34.760Z INFO 230151 --- [Pool-1-worker-3] t.c.s.AnnotationConfigContextLoaderUtils : Could not detect default configuration classes for test class [org.vaadin.addons.dramafinder.tests.it.DatePickerGetByLabelIT]: DatePickerGetByLabelIT does not declare any static, non-private, non-final, nested classes annotated with @Configuration.
2026-09-21T13:43:34.760Z INFO 230151 --- [Pool-1-worker-3] t.c.s.AnnotationConfigContextLoaderUtils : Could not detect default configuration classes for test class [org.vaadin.addons.dramafinder.tests.it.SpringPlaywrightIT]: SpringPlaywrightIT does not declare any static, non-private, non-final, nested classes annotated with @Configuration.
2026-09-21T13:43:34.760Z INFO 230151 --- [Pool-1-worker-3] t.c.s.AnnotationConfigContextLoaderUtils : Could not detect default configuration classes for test class [org.vaadin.addons.dramafinder.AbstractBasePlaywrightIT]: AbstractBasePlaywrightIT does not declare any static, non-private, non-final, nested classes annotated with @Configuration.
2026-09-21T13:43:34.761Z INFO 230151 --- [Pool-1-worker-3] .b.t.c.SpringBootTestContextBootstrapper : Found @SpringBootConfiguration org.vaadin.addons.dramafinder.tests.TestServer for test class org.vaadin.addons.dramafinder.tests.it.DatePickerGetByLabelIT
[INFO] Tests run: 3, Failures: 0, Errors: 0, Skipped: 0, Time elapsed: 5.301 s -- in org.vaadin.addons.dramafinder.tests.it.ComboBoxGetByLabelIT
[INFO] Running org.vaadin.addons.dramafinder.tests.it.TextFieldGetByLabelIT
2026-09-21T13:43:35.172Z INFO 230151 --- [Pool-1-worker-1] t.c.s.AnnotationConfigContextLoaderUtils : Could not detect default configuration classes for test class [org.vaadin.addons.dramafinder.tests.it.TextFieldGetByLabelIT]: TextFieldGetByLabelIT does not declare any static, non-private, non-final, nested classes annotated with @Configuration.
2026-09-21T13:43:35.173Z INFO 230151 --- [Pool-1-worker-1] .b.t.c.SpringBootTestContextBootstrapper : Found @SpringBootConfiguration org.vaadin.addons.dramafinder.tests.TestServer for test class org.vaadin.addons.dramafinder.tests.it.TextFieldGetByLabelIT
2026-09-21T13:43:35.174Z INFO 230151 --- [Pool-1-worker-1] t.c.s.AnnotationConfigContextLoaderUtils : Could not detect default configuration classes for test class [org.vaadin.addons.dramafinder.tests.it.TextFieldGetByLabelIT]: TextFieldGetByLabelIT does not declare any static, non-private, non-final, nested classes annotated with @Configuration.
2026-09-21T13:43:35.174Z INFO 230151 --- [Pool-1-worker-1] t.c.s.AnnotationConfigContextLoaderUtils : Could not detect default configuration classes for test class [org.vaadin.addons.dramafinder.tests.it.SpringPlaywrightIT]: SpringPlaywrightIT does not declare any static, non-private, non-final, nested classes annotated with @Configuration.
2026-09-21T13:43:35.174Z INFO 230151 --- [Pool-1-worker-1] t.c.s.AnnotationConfigContextLoaderUtils : Could not detect default configuration classes for test class [org.vaadin.addons.dramafinder.AbstractBasePlaywrightIT]: AbstractBasePlaywrightIT does not declare any static, non-private, non-final, nested classes annotated with @Configuration.
2026-09-21T13:43:35.175Z INFO 230151 --- [Pool-1-worker-1] .b.t.c.SpringBootTestContextBootstrapper : Found @SpringBootConfiguration org.vaadin.addons.dramafinder.tests.TestServer for test class org.vaadin.addons.dramafinder.tests.it.TextFieldGetByLabelIT
[INFO] Tests run: 3, Failures: 0, Errors: 0, Skipped: 0, Time elapsed: 4.950 s -- in org.vaadin.addons.dramafinder.tests.it.DatePickerGetByLabelIT
[INFO] Running org.vaadin.addons.dramafinder.tests.it.DialogViewIT
2026-09-21T13:43:39.708Z INFO 230151 --- [Pool-1-worker-3] t.c.s.AnnotationConfigContextLoaderUtils : Could not detect default configuration classes for test class [org.vaadin.addons.dramafinder.tests.it.DialogViewIT]: DialogViewIT does not declare any static, non-private, non-final, nested classes annotated with @Configuration.
2026-09-21T13:43:39.709Z INFO 230151 --- [Pool-1-worker-3] .b.t.c.SpringBootTestContextBootstrapper : Found @SpringBootConfiguration org.vaadin.addons.dramafinder.tests.TestServer for test class org.vaadin.addons.dramafinder.tests.it.DialogViewIT
2026-09-21T13:43:39.711Z INFO 230151 --- [Pool-1-worker-3] t.c.s.AnnotationConfigContextLoaderUtils : Could not detect default configuration classes for test class [org.vaadin.addons.dramafinder.tests.it.DialogViewIT]: DialogViewIT does not declare any static, non-private, non-final, nested classes annotated with @Configuration.
2026-09-21T13:43:39.711Z INFO 230151 --- [Pool-1-worker-3] t.c.s.AnnotationConfigContextLoaderUtils : Could not detect default configuration classes for test class [org.vaadin.addons.dramafinder.tests.it.SpringPlaywrightIT]: SpringPlaywrightIT does not declare any static, non-private, non-final, nested classes annotated with @Configuration.
2026-09-21T13:43:39.720Z INFO 230151 --- [Pool-1-worker-3] t.c.s.AnnotationConfigContextLoaderUtils : Could not detect default configuration classes for test class [org.vaadin.addons.dramafinder.AbstractBasePlaywrightIT]: AbstractBasePlaywrightIT does not declare any static, non-private, non-final, nested classes annotated with @Configuration.
2026-09-21T13:43:39.721Z INFO 230151 --- [Pool-1-worker-3] .b.t.c.SpringBootTestContextBootstrapper : Found @SpringBootConfiguration org.vaadin.addons.dramafinder.tests.TestServer for test class org.vaadin.addons.dramafinder.tests.it.DialogViewIT
[INFO] Tests run: 23, Failures: 0, Errors: 0, Skipped: 0, Time elapsed: 37.78 s -- in org.vaadin.addons.dramafinder.tests.it.TextAreaViewIT
[INFO] Running org.vaadin.addons.dramafinder.tests.it.BigDecimalFieldGetByLabelIT
2026-09-21T13:43:42.649Z INFO 230151 --- [Pool-1-worker-2] t.c.s.AnnotationConfigContextLoaderUtils : Could not detect default configuration classes for test class [org.vaadin.addons.dramafinder.tests.it.BigDecimalFieldGetByLabelIT]: BigDecimalFieldGetByLabelIT does not declare any static, non-private, non-final, nested classes annotated with @Configuration.
2026-09-21T13:43:42.653Z INFO 230151 --- [Pool-1-worker-2] .b.t.c.SpringBootTestContextBootstrapper : Found @SpringBootConfiguration org.vaadin.addons.dramafinder.tests.TestServer for test class org.vaadin.addons.dramafinder.tests.it.BigDecimalFieldGetByLabelIT
2026-09-21T13:43:42.653Z INFO 230151 --- [Pool-1-worker-2] t.c.s.AnnotationConfigContextLoaderUtils : Could not detect default configuration classes for test class [org.vaadin.addons.dramafinder.tests.it.BigDecimalFieldGetByLabelIT]: BigDecimalFieldGetByLabelIT does not declare any static, non-private, non-final, nested classes annotated with @Configuration.
2026-09-21T13:43:42.654Z INFO 230151 --- [Pool-1-worker-2] t.c.s.AnnotationConfigContextLoaderUtils : Could not detect default configuration classes for test class [org.vaadin.addons.dramafinder.tests.it.SpringPlaywrightIT]: SpringPlaywrightIT does not declare any static, non-private, non-final, nested classes annotated with @Configuration.
2026-09-21T13:43:42.654Z INFO 230151 --- [Pool-1-worker-2] t.c.s.AnnotationConfigContextLoaderUtils : Could not detect default configuration classes for test class [org.vaadin.addons.dramafinder.AbstractBasePlaywrightIT]: AbstractBasePlaywrightIT does not declare any static, non-private, non-final, nested classes annotated with @Configuration.
2026-09-21T13:43:42.657Z INFO 230151 --- [Pool-1-worker-2] .b.t.c.SpringBootTestContextBootstrapper : Found @SpringBootConfiguration org.vaadin.addons.dramafinder.tests.TestServer for test class org.vaadin.addons.dramafinder.tests.it.BigDecimalFieldGetByLabelIT
[INFO] Tests run: 8, Failures: 0, Errors: 0, Skipped: 0, Time elapsed: 11.98 s -- in org.vaadin.addons.dramafinder.tests.it.TextFieldGetByLabelIT
[INFO] Running org.vaadin.addons.dramafinder.tests.it.TimePickerGetByLabelIT
2026-09-21T13:43:47.159Z INFO 230151 --- [Pool-1-worker-1] t.c.s.AnnotationConfigContextLoaderUtils : Could not detect default configuration classes for test class [org.vaadin.addons.dramafinder.tests.it.TimePickerGetByLabelIT]: TimePickerGetByLabelIT does not declare any static, non-private, non-final, nested classes annotated with @Configuration.
2026-09-21T13:43:47.159Z INFO 230151 --- [Pool-1-worker-1] .b.t.c.SpringBootTestContextBootstrapper : Found @SpringBootConfiguration org.vaadin.addons.dramafinder.tests.TestServer for test class org.vaadin.addons.dramafinder.tests.it.TimePickerGetByLabelIT
2026-09-21T13:43:47.160Z INFO 230151 --- [Pool-1-worker-1] t.c.s.AnnotationConfigContextLoaderUtils : Could not detect default configuration classes for test class [org.vaadin.addons.dramafinder.tests.it.TimePickerGetByLabelIT]: TimePickerGetByLabelIT does not declare any static, non-private, non-final, nested classes annotated with @Configuration.
2026-09-21T13:43:47.160Z INFO 230151 --- [Pool-1-worker-1] t.c.s.AnnotationConfigContextLoaderUtils : Could not detect default configuration classes for test class [org.vaadin.addons.dramafinder.tests.it.SpringPlaywrightIT]: SpringPlaywrightIT does not declare any static, non-private, non-final, nested classes annotated with @Configuration.
2026-09-21T13:43:47.160Z INFO 230151 --- [Pool-1-worker-1] t.c.s.AnnotationConfigContextLoaderUtils : Could not detect default configuration classes for test class [org.vaadin.addons.dramafinder.AbstractBasePlaywrightIT]: AbstractBasePlaywrightIT does not declare any static, non-private, non-final, nested classes annotated with @Configuration.
2026-09-21T13:43:47.161Z INFO 230151 --- [Pool-1-worker-1] .b.t.c.SpringBootTestContextBootstrapper : Found @SpringBootConfiguration org.vaadin.addons.dramafinder.tests.TestServer for test class org.vaadin.addons.dramafinder.tests.it.TimePickerGetByLabelIT
[INFO] Tests run: 3, Failures: 0, Errors: 0, Skipped: 0, Time elapsed: 5.110 s -- in org.vaadin.addons.dramafinder.tests.it.BigDecimalFieldGetByLabelIT
[INFO] Running org.vaadin.addons.dramafinder.tests.it.TreeGridBasicViewIT
2026-09-21T13:43:47.757Z INFO 230151 --- [Pool-1-worker-2] t.c.s.AnnotationConfigContextLoaderUtils : Could not detect default configuration classes for test class [org.vaadin.addons.dramafinder.tests.it.TreeGridBasicViewIT]: TreeGridBasicViewIT does not declare any static, non-private, non-final, nested classes annotated with @Configuration.
2026-09-21T13:43:47.767Z INFO 230151 --- [Pool-1-worker-2] .b.t.c.SpringBootTestContextBootstrapper : Found @SpringBootConfiguration org.vaadin.addons.dramafinder.tests.TestServer for test class org.vaadin.addons.dramafinder.tests.it.TreeGridBasicViewIT
2026-09-21T13:43:47.768Z INFO 230151 --- [Pool-1-worker-2] t.c.s.AnnotationConfigContextLoaderUtils : Could not detect default configuration classes for test class [org.vaadin.addons.dramafinder.tests.it.TreeGridBasicViewIT]: TreeGridBasicViewIT does not declare any static, non-private, non-final, nested classes annotated with @Configuration.
2026-09-21T13:43:47.768Z INFO 230151 --- [Pool-1-worker-2] t.c.s.AnnotationConfigContextLoaderUtils : Could not detect default configuration classes for test class [org.vaadin.addons.dramafinder.tests.it.SpringPlaywrightIT]: SpringPlaywrightIT does not declare any static, non-private, non-final, nested classes annotated with @Configuration.
2026-09-21T13:43:47.768Z INFO 230151 --- [Pool-1-worker-2] t.c.s.AnnotationConfigContextLoaderUtils : Could not detect default configuration classes for test class [org.vaadin.addons.dramafinder.AbstractBasePlaywrightIT]: AbstractBasePlaywrightIT does not declare any static, non-private, non-final, nested classes annotated with @Configuration.
2026-09-21T13:43:47.774Z INFO 230151 --- [Pool-1-worker-2] .b.t.c.SpringBootTestContextBootstrapper : Found @SpringBootConfiguration org.vaadin.addons.dramafinder.tests.TestServer for test class org.vaadin.addons.dramafinder.tests.it.TreeGridBasicViewIT
[INFO] Tests run: 5, Failures: 0, Errors: 0, Skipped: 0, Time elapsed: 11.19 s -- in org.vaadin.addons.dramafinder.tests.it.DialogViewIT
[INFO] Running org.vaadin.addons.dramafinder.tests.it.SideNavigationElementViewIT
2026-09-21T13:43:50.903Z INFO 230151 --- [Pool-1-worker-3] t.c.s.AnnotationConfigContextLoaderUtils : Could not detect default configuration classes for test class [org.vaadin.addons.dramafinder.tests.it.SideNavigationElementViewIT]: SideNavigationElementViewIT does not declare any static, non-private, non-final, nested classes annotated with @Configuration.
2026-09-21T13:43:50.910Z INFO 230151 --- [Pool-1-worker-3] .b.t.c.SpringBootTestContextBootstrapper : Found @SpringBootConfiguration org.vaadin.addons.dramafinder.tests.TestServer for test class org.vaadin.addons.dramafinder.tests.it.SideNavigationElementViewIT
2026-09-21T13:43:50.911Z INFO 230151 --- [Pool-1-worker-3] t.c.s.AnnotationConfigContextLoaderUtils : Could not detect default configuration classes for test class [org.vaadin.addons.dramafinder.tests.it.SideNavigationElementViewIT]: SideNavigationElementViewIT does not declare any static, non-private, non-final, nested classes annotated with @Configuration.
2026-09-21T13:43:50.911Z INFO 230151 --- [Pool-1-worker-3] t.c.s.AnnotationConfigContextLoaderUtils : Could not detect default configuration classes for test class [org.vaadin.addons.dramafinder.tests.it.SpringPlaywrightIT]: SpringPlaywrightIT does not declare any static, non-private, non-final, nested classes annotated with @Configuration.
2026-09-21T13:43:50.911Z INFO 230151 --- [Pool-1-worker-3] t.c.s.AnnotationConfigContextLoaderUtils : Could not detect default configuration classes for test class [org.vaadin.addons.dramafinder.AbstractBasePlaywrightIT]: AbstractBasePlaywrightIT does not declare any static, non-private, non-final, nested classes annotated with @Configuration.
2026-09-21T13:43:50.912Z INFO 230151 --- [Pool-1-worker-3] .b.t.c.SpringBootTestContextBootstrapper : Found @SpringBootConfiguration org.vaadin.addons.dramafinder.tests.TestServer for test class org.vaadin.addons.dramafinder.tests.it.SideNavigationElementViewIT
[INFO] Tests run: 3, Failures: 0, Errors: 0, Skipped: 0, Time elapsed: 5.280 s -- in org.vaadin.addons.dramafinder.tests.it.TimePickerGetByLabelIT
[INFO] Running org.vaadin.addons.dramafinder.tests.it.GridBasicViewIT
2026-09-21T13:43:52.442Z INFO 230151 --- [Pool-1-worker-1] t.c.s.AnnotationConfigContextLoaderUtils : Could not detect default configuration classes for test class [org.vaadin.addons.dramafinder.tests.it.GridBasicViewIT]: GridBasicViewIT does not declare any static, non-private, non-final, nested classes annotated with @Configuration.
2026-09-21T13:43:52.452Z INFO 230151 --- [Pool-1-worker-1] .b.t.c.SpringBootTestContextBootstrapper : Found @SpringBootConfiguration org.vaadin.addons.dramafinder.tests.TestServer for test class org.vaadin.addons.dramafinder.tests.it.GridBasicViewIT
2026-09-21T13:43:52.452Z INFO 230151 --- [Pool-1-worker-1] t.c.s.AnnotationConfigContextLoaderUtils : Could not detect default configuration classes for test class [org.vaadin.addons.dramafinder.tests.it.GridBasicViewIT]: GridBasicViewIT does not declare any static, non-private, non-final, nested classes annotated with @Configuration.
2026-09-21T13:43:52.453Z INFO 230151 --- [Pool-1-worker-1] t.c.s.AnnotationConfigContextLoaderUtils : Could not detect default configuration classes for test class [org.vaadin.addons.dramafinder.tests.it.SpringPlaywrightIT]: SpringPlaywrightIT does not declare any static, non-private, non-final, nested classes annotated with @Configuration.
2026-09-21T13:43:52.453Z INFO 230151 --- [Pool-1-worker-1] t.c.s.AnnotationConfigContextLoaderUtils : Could not detect default configuration classes for test class [org.vaadin.addons.dramafinder.AbstractBasePlaywrightIT]: AbstractBasePlaywrightIT does not declare any static, non-private, non-final, nested classes annotated with @Configuration.
2026-09-21T13:43:52.453Z INFO 230151 --- [Pool-1-worker-1] .b.t.c.SpringBootTestContextBootstrapper : Found @SpringBootConfiguration org.vaadin.addons.dramafinder.tests.TestServer for test class org.vaadin.addons.dramafinder.tests.it.GridBasicViewIT
[INFO] Tests run: 8, Failures: 0, Errors: 0, Skipped: 0, Time elapsed: 14.64 s -- in org.vaadin.addons.dramafinder.tests.it.SideNavigationElementViewIT
[INFO] Running org.vaadin.addons.dramafinder.tests.it.AvatarViewIT
2026-09-21T13:44:05.551Z INFO 230151 --- [Pool-1-worker-3] t.c.s.AnnotationConfigContextLoaderUtils : Could not detect default configuration classes for test class [org.vaadin.addons.dramafinder.tests.it.AvatarViewIT]: AvatarViewIT does not declare any static, non-private, non-final, nested classes annotated with @Configuration.
2026-09-21T13:44:05.552Z INFO 230151 --- [Pool-1-worker-3] .b.t.c.SpringBootTestContextBootstrapper : Found @SpringBootConfiguration org.vaadin.addons.dramafinder.tests.TestServer for test class org.vaadin.addons.dramafinder.tests.it.AvatarViewIT
2026-09-21T13:44:05.553Z INFO 230151 --- [Pool-1-worker-3] t.c.s.AnnotationConfigContextLoaderUtils : Could not detect default configuration classes for test class [org.vaadin.addons.dramafinder.tests.it.AvatarViewIT]: AvatarViewIT does not declare any static, non-private, non-final, nested classes annotated with @Configuration.
2026-09-21T13:44:05.553Z INFO 230151 --- [Pool-1-worker-3] t.c.s.AnnotationConfigContextLoaderUtils : Could not detect default configuration classes for test class [org.vaadin.addons.dramafinder.tests.it.SpringPlaywrightIT]: SpringPlaywrightIT does not declare any static, non-private, non-final, nested classes annotated with @Configuration.
2026-09-21T13:44:05.553Z INFO 230151 --- [Pool-1-worker-3] t.c.s.AnnotationConfigContextLoaderUtils : Could not detect default configuration classes for test class [org.vaadin.addons.dramafinder.AbstractBasePlaywrightIT]: AbstractBasePlaywrightIT does not declare any static, non-private, non-final, nested classes annotated with @Configuration.
2026-09-21T13:44:05.554Z INFO 230151 --- [Pool-1-worker-3] .b.t.c.SpringBootTestContextBootstrapper : Found @SpringBootConfiguration org.vaadin.addons.dramafinder.tests.TestServer for test class org.vaadin.addons.dramafinder.tests.it.AvatarViewIT
[INFO] Tests run: 16, Failures: 0, Errors: 0, Skipped: 0, Time elapsed: 32.79 s -- in org.vaadin.addons.dramafinder.tests.it.TreeGridBasicViewIT
[INFO] Running org.vaadin.addons.dramafinder.tests.it.DateTimePickerGetByLabelIT
2026-09-21T13:44:20.556Z INFO 230151 --- [Pool-1-worker-2] t.c.s.AnnotationConfigContextLoaderUtils : Could not detect default configuration classes for test class [org.vaadin.addons.dramafinder.tests.it.DateTimePickerGetByLabelIT]: DateTimePickerGetByLabelIT does not declare any static, non-private, non-final, nested classes annotated with @Configuration.
2026-09-21T13:44:20.559Z INFO 230151 --- [Pool-1-worker-2] .b.t.c.SpringBootTestContextBootstrapper : Found @SpringBootConfiguration org.vaadin.addons.dramafinder.tests.TestServer for test class org.vaadin.addons.dramafinder.tests.it.DateTimePickerGetByLabelIT
2026-09-21T13:44:20.560Z INFO 230151 --- [Pool-1-worker-2] t.c.s.AnnotationConfigContextLoaderUtils : Could not detect default configuration classes for test class [org.vaadin.addons.dramafinder.tests.it.DateTimePickerGetByLabelIT]: DateTimePickerGetByLabelIT does not declare any static, non-private, non-final, nested classes annotated with @Configuration.
2026-09-21T13:44:20.561Z INFO 230151 --- [Pool-1-worker-2] t.c.s.AnnotationConfigContextLoaderUtils : Could not detect default configuration classes for test class [org.vaadin.addons.dramafinder.tests.it.SpringPlaywrightIT]: SpringPlaywrightIT does not declare any static, non-private, non-final, nested classes annotated with @Configuration.
2026-09-21T13:44:20.561Z INFO 230151 --- [Pool-1-worker-2] t.c.s.AnnotationConfigContextLoaderUtils : Could not detect default configuration classes for test class [org.vaadin.addons.dramafinder.AbstractBasePlaywrightIT]: AbstractBasePlaywrightIT does not declare any static, non-private, non-final, nested classes annotated with @Configuration.
2026-09-21T13:44:20.566Z INFO 230151 --- [Pool-1-worker-2] .b.t.c.SpringBootTestContextBootstrapper : Found @SpringBootConfiguration org.vaadin.addons.dramafinder.tests.TestServer for test class org.vaadin.addons.dramafinder.tests.it.DateTimePickerGetByLabelIT
[INFO] Tests run: 3, Failures: 0, Errors: 0, Skipped: 0, Time elapsed: 5.002 s -- in org.vaadin.addons.dramafinder.tests.it.DateTimePickerGetByLabelIT
[INFO] Running org.vaadin.addons.dramafinder.tests.it.SliderViewIT
2026-09-21T13:44:25.556Z INFO 230151 --- [Pool-1-worker-2] t.c.s.AnnotationConfigContextLoaderUtils : Could not detect default configuration classes for test class [org.vaadin.addons.dramafinder.tests.it.SliderViewIT]: SliderViewIT does not declare any static, non-private, non-final, nested classes annotated with @Configuration.
2026-09-21T13:44:25.563Z INFO 230151 --- [Pool-1-worker-2] .b.t.c.SpringBootTestContextBootstrapper : Found @SpringBootConfiguration org.vaadin.addons.dramafinder.tests.TestServer for test class org.vaadin.addons.dramafinder.tests.it.SliderViewIT
2026-09-21T13:44:25.565Z INFO 230151 --- [Pool-1-worker-2] t.c.s.AnnotationConfigContextLoaderUtils : Could not detect default configuration classes for test class [org.vaadin.addons.dramafinder.tests.it.SliderViewIT]: SliderViewIT does not declare any static, non-private, non-final, nested classes annotated with @Configuration.
2026-09-21T13:44:25.565Z INFO 230151 --- [Pool-1-worker-2] t.c.s.AnnotationConfigContextLoaderUtils : Could not detect default configuration classes for test class [org.vaadin.addons.dramafinder.tests.it.SpringPlaywrightIT]: SpringPlaywrightIT does not declare any static, non-private, non-final, nested classes annotated with @Configuration.
2026-09-21T13:44:25.565Z INFO 230151 --- [Pool-1-worker-2] t.c.s.AnnotationConfigContextLoaderUtils : Could not detect default configuration classes for test class [org.vaadin.addons.dramafinder.AbstractBasePlaywrightIT]: AbstractBasePlaywrightIT does not declare any static, non-private, non-final, nested classes annotated with @Configuration.
2026-09-21T13:44:25.566Z INFO 230151 --- [Pool-1-worker-2] .b.t.c.SpringBootTestContextBootstrapper : Found @SpringBootConfiguration org.vaadin.addons.dramafinder.tests.TestServer for test class org.vaadin.addons.dramafinder.tests.it.SliderViewIT
[INFO] Tests run: 14, Failures: 0, Errors: 0, Skipped: 0, Time elapsed: 23.36 s -- in org.vaadin.addons.dramafinder.tests.it.AvatarViewIT
[INFO] Running org.vaadin.addons.dramafinder.tests.it.BadgeViewIT
2026-09-21T13:44:28.907Z INFO 230151 --- [Pool-1-worker-3] t.c.s.AnnotationConfigContextLoaderUtils : Could not detect default configuration classes for test class [org.vaadin.addons.dramafinder.tests.it.BadgeViewIT]: BadgeViewIT does not declare any static, non-private, non-final, nested classes annotated with @Configuration.
2026-09-21T13:44:28.911Z INFO 230151 --- [Pool-1-worker-3] .b.t.c.SpringBootTestContextBootstrapper : Found @SpringBootConfiguration org.vaadin.addons.dramafinder.tests.TestServer for test class org.vaadin.addons.dramafinder.tests.it.BadgeViewIT
2026-09-21T13:44:28.912Z INFO 230151 --- [Pool-1-worker-3] t.c.s.AnnotationConfigContextLoaderUtils : Could not detect default configuration classes for test class [org.vaadin.addons.dramafinder.tests.it.BadgeViewIT]: BadgeViewIT does not declare any static, non-private, non-final, nested classes annotated with @Configuration.
2026-09-21T13:44:28.912Z INFO 230151 --- [Pool-1-worker-3] t.c.s.AnnotationConfigContextLoaderUtils : Could not detect default configuration classes for test class [org.vaadin.addons.dramafinder.tests.it.SpringPlaywrightIT]: SpringPlaywrightIT does not declare any static, non-private, non-final, nested classes annotated with @Configuration.
2026-09-21T13:44:28.912Z INFO 230151 --- [Pool-1-worker-3] t.c.s.AnnotationConfigContextLoaderUtils : Could not detect default configuration classes for test class [org.vaadin.addons.dramafinder.AbstractBasePlaywrightIT]: AbstractBasePlaywrightIT does not declare any static, non-private, non-final, nested classes annotated with @Configuration.
2026-09-21T13:44:28.913Z INFO 230151 --- [Pool-1-worker-3] .b.t.c.SpringBootTestContextBootstrapper : Found @SpringBootConfiguration org.vaadin.addons.dramafinder.tests.TestServer for test class org.vaadin.addons.dramafinder.tests.it.BadgeViewIT
[INFO] Tests run: 9, Failures: 0, Errors: 0, Skipped: 0, Time elapsed: 16.41 s -- in org.vaadin.addons.dramafinder.tests.it.SliderViewIT
[INFO] Running org.vaadin.addons.dramafinder.tests.it.GridSortingViewIT
2026-09-21T13:44:41.963Z INFO 230151 --- [Pool-1-worker-2] t.c.s.AnnotationConfigContextLoaderUtils : Could not detect default configuration classes for test class [org.vaadin.addons.dramafinder.tests.it.GridSortingViewIT]: GridSortingViewIT does not declare any static, non-private, non-final, nested classes annotated with @Configuration.
2026-09-21T13:44:41.965Z INFO 230151 --- [Pool-1-worker-2] .b.t.c.SpringBootTestContextBootstrapper : Found @SpringBootConfiguration org.vaadin.addons.dramafinder.tests.TestServer for test class org.vaadin.addons.dramafinder.tests.it.GridSortingViewIT
2026-09-21T13:44:41.965Z INFO 230151 --- [Pool-1-worker-2] t.c.s.AnnotationConfigContextLoaderUtils : Could not detect default configuration classes for test class [org.vaadin.addons.dramafinder.tests.it.GridSortingViewIT]: GridSortingViewIT does not declare any static, non-private, non-final, nested classes annotated with @Configuration.
2026-09-21T13:44:41.966Z INFO 230151 --- [Pool-1-worker-2] t.c.s.AnnotationConfigContextLoaderUtils : Could not detect default configuration classes for test class [org.vaadin.addons.dramafinder.tests.it.SpringPlaywrightIT]: SpringPlaywrightIT does not declare any static, non-private, non-final, nested classes annotated with @Configuration.
2026-09-21T13:44:41.966Z INFO 230151 --- [Pool-1-worker-2] t.c.s.AnnotationConfigContextLoaderUtils : Could not detect default configuration classes for test class [org.vaadin.addons.dramafinder.AbstractBasePlaywrightIT]: AbstractBasePlaywrightIT does not declare any static, non-private, non-final, nested classes annotated with @Configuration.
2026-09-21T13:44:41.966Z INFO 230151 --- [Pool-1-worker-2] .b.t.c.SpringBootTestContextBootstrapper : Found @SpringBootConfiguration org.vaadin.addons.dramafinder.tests.TestServer for test class org.vaadin.addons.dramafinder.tests.it.GridSortingViewIT
[INFO] Tests run: 6, Failures: 0, Errors: 0, Skipped: 0, Time elapsed: 11.05 s -- in org.vaadin.addons.dramafinder.tests.it.GridSortingViewIT
[INFO] Running org.vaadin.addons.dramafinder.tests.it.AmbiguousLabelIT
2026-09-21T13:44:53.021Z INFO 230151 --- [Pool-1-worker-2] t.c.s.AnnotationConfigContextLoaderUtils : Could not detect default configuration classes for test class [org.vaadin.addons.dramafinder.tests.it.AmbiguousLabelIT]: AmbiguousLabelIT does not declare any static, non-private, non-final, nested classes annotated with @Configuration.
2026-09-21T13:44:53.022Z INFO 230151 --- [Pool-1-worker-2] .b.t.c.SpringBootTestContextBootstrapper : Found @SpringBootConfiguration org.vaadin.addons.dramafinder.tests.TestServer for test class org.vaadin.addons.dramafinder.tests.it.AmbiguousLabelIT
2026-09-21T13:44:53.023Z INFO 230151 --- [Pool-1-worker-2] t.c.s.AnnotationConfigContextLoaderUtils : Could not detect default configuration classes for test class [org.vaadin.addons.dramafinder.tests.it.AmbiguousLabelIT]: AmbiguousLabelIT does not declare any static, non-private, non-final, nested classes annotated with @Configuration.
2026-09-21T13:44:53.023Z INFO 230151 --- [Pool-1-worker-2] t.c.s.AnnotationConfigContextLoaderUtils : Could not detect default configuration classes for test class [org.vaadin.addons.dramafinder.tests.it.SpringPlaywrightIT]: SpringPlaywrightIT does not declare any static, non-private, non-final, nested classes annotated with @Configuration.
2026-09-21T13:44:53.023Z INFO 230151 --- [Pool-1-worker-2] t.c.s.AnnotationConfigContextLoaderUtils : Could not detect default configuration classes for test class [org.vaadin.addons.dramafinder.AbstractBasePlaywrightIT]: AbstractBasePlaywrightIT does not declare any static, non-private, non-final, nested classes annotated with @Configuration.
2026-09-21T13:44:53.024Z INFO 230151 --- [Pool-1-worker-2] .b.t.c.SpringBootTestContextBootstrapper : Found @SpringBootConfiguration org.vaadin.addons.dramafinder.tests.TestServer for test class org.vaadin.addons.dramafinder.tests.it.AmbiguousLabelIT
[INFO] Tests run: 25, Failures: 0, Errors: 0, Skipped: 0, Time elapsed: 44.68 s -- in org.vaadin.addons.dramafinder.tests.it.BadgeViewIT
[INFO] Running org.vaadin.addons.dramafinder.tests.it.CheckboxGroupViewIT
2026-09-21T13:45:13.593Z INFO 230151 --- [Pool-1-worker-3] t.c.s.AnnotationConfigContextLoaderUtils : Could not detect default configuration classes for test class [org.vaadin.addons.dramafinder.tests.it.CheckboxGroupViewIT]: CheckboxGroupViewIT does not declare any static, non-private, non-final, nested classes annotated with @Configuration.
2026-09-21T13:45:13.595Z INFO 230151 --- [Pool-1-worker-3] .b.t.c.SpringBootTestContextBootstrapper : Found @SpringBootConfiguration org.vaadin.addons.dramafinder.tests.TestServer for test class org.vaadin.addons.dramafinder.tests.it.CheckboxGroupViewIT
2026-09-21T13:45:13.596Z INFO 230151 --- [Pool-1-worker-3] t.c.s.AnnotationConfigContextLoaderUtils : Could not detect default configuration classes for test class [org.vaadin.addons.dramafinder.tests.it.CheckboxGroupViewIT]: CheckboxGroupViewIT does not declare any static, non-private, non-final, nested classes annotated with @Configuration.
2026-09-21T13:45:13.596Z INFO 230151 --- [Pool-1-worker-3] t.c.s.AnnotationConfigContextLoaderUtils : Could not detect default configuration classes for test class [org.vaadin.addons.dramafinder.tests.it.SpringPlaywrightIT]: SpringPlaywrightIT does not declare any static, non-private, non-final, nested classes annotated with @Configuration.
2026-09-21T13:45:13.596Z INFO 230151 --- [Pool-1-worker-3] t.c.s.AnnotationConfigContextLoaderUtils : Could not detect default configuration classes for test class [org.vaadin.addons.dramafinder.AbstractBasePlaywrightIT]: AbstractBasePlaywrightIT does not declare any static, non-private, non-final, nested classes annotated with @Configuration.
2026-09-21T13:45:13.596Z INFO 230151 --- [Pool-1-worker-3] .b.t.c.SpringBootTestContextBootstrapper : Found @SpringBootConfiguration org.vaadin.addons.dramafinder.tests.TestServer for test class org.vaadin.addons.dramafinder.tests.it.CheckboxGroupViewIT
[INFO] Tests run: 12, Failures: 0, Errors: 0, Skipped: 0, Time elapsed: 21.25 s -- in org.vaadin.addons.dramafinder.tests.it.AmbiguousLabelIT
[INFO] Running org.vaadin.addons.dramafinder.tests.it.TreeGridSelectionViewIT
2026-09-21T13:45:14.268Z INFO 230151 --- [Pool-1-worker-2] t.c.s.AnnotationConfigContextLoaderUtils : Could not detect default configuration classes for test class [org.vaadin.addons.dramafinder.tests.it.TreeGridSelectionViewIT]: TreeGridSelectionViewIT does not declare any static, non-private, non-final, nested classes annotated with @Configuration.
2026-09-21T13:45:14.269Z INFO 230151 --- [Pool-1-worker-2] .b.t.c.SpringBootTestContextBootstrapper : Found @SpringBootConfiguration org.vaadin.addons.dramafinder.tests.TestServer for test class org.vaadin.addons.dramafinder.tests.it.TreeGridSelectionViewIT
2026-09-21T13:45:14.269Z INFO 230151 --- [Pool-1-worker-2] t.c.s.AnnotationConfigContextLoaderUtils : Could not detect default configuration classes for test class [org.vaadin.addons.dramafinder.tests.it.TreeGridSelectionViewIT]: TreeGridSelectionViewIT does not declare any static, non-private, non-final, nested classes annotated with @Configuration.
2026-09-21T13:45:14.269Z INFO 230151 --- [Pool-1-worker-2] t.c.s.AnnotationConfigContextLoaderUtils : Could not detect default configuration classes for test class [org.vaadin.addons.dramafinder.tests.it.SpringPlaywrightIT]: SpringPlaywrightIT does not declare any static, non-private, non-final, nested classes annotated with @Configuration.
2026-09-21T13:45:14.270Z INFO 230151 --- [Pool-1-worker-2] t.c.s.AnnotationConfigContextLoaderUtils : Could not detect default configuration classes for test class [org.vaadin.addons.dramafinder.AbstractBasePlaywrightIT]: AbstractBasePlaywrightIT does not declare any static, non-private, non-final, nested classes annotated with @Configuration.
2026-09-21T13:45:14.270Z INFO 230151 --- [Pool-1-worker-2] .b.t.c.SpringBootTestContextBootstrapper : Found @SpringBootConfiguration org.vaadin.addons.dramafinder.tests.TestServer for test class org.vaadin.addons.dramafinder.tests.it.TreeGridSelectionViewIT
[INFO] Tests run: 12, Failures: 0, Errors: 0, Skipped: 0, Time elapsed: 19.85 s -- in org.vaadin.addons.dramafinder.tests.it.CheckboxGroupViewIT
[INFO] Running org.vaadin.addons.dramafinder.tests.it.GridLitRendererViewIT
2026-09-21T13:45:33.441Z INFO 230151 --- [Pool-1-worker-3] t.c.s.AnnotationConfigContextLoaderUtils : Could not detect default configuration classes for test class [org.vaadin.addons.dramafinder.tests.it.GridLitRendererViewIT]: GridLitRendererViewIT does not declare any static, non-private, non-final, nested classes annotated with @Configuration.
2026-09-21T13:45:33.442Z INFO 230151 --- [Pool-1-worker-3] .b.t.c.SpringBootTestContextBootstrapper : Found @SpringBootConfiguration org.vaadin.addons.dramafinder.tests.TestServer for test class org.vaadin.addons.dramafinder.tests.it.GridLitRendererViewIT
2026-09-21T13:45:33.443Z INFO 230151 --- [Pool-1-worker-3] t.c.s.AnnotationConfigContextLoaderUtils : Could not detect default configuration classes for test class [org.vaadin.addons.dramafinder.tests.it.GridLitRendererViewIT]: GridLitRendererViewIT does not declare any static, non-private, non-final, nested classes annotated with @Configuration.
2026-09-21T13:45:33.443Z INFO 230151 --- [Pool-1-worker-3] t.c.s.AnnotationConfigContextLoaderUtils : Could not detect default configuration classes for test class [org.vaadin.addons.dramafinder.tests.it.SpringPlaywrightIT]: SpringPlaywrightIT does not declare any static, non-private, non-final, nested classes annotated with @Configuration.
2026-09-21T13:45:33.443Z INFO 230151 --- [Pool-1-worker-3] t.c.s.AnnotationConfigContextLoaderUtils : Could not detect default configuration classes for test class [org.vaadin.addons.dramafinder.AbstractBasePlaywrightIT]: AbstractBasePlaywrightIT does not declare any static, non-private, non-final, nested classes annotated with @Configuration.
2026-09-21T13:45:33.444Z INFO 230151 --- [Pool-1-worker-3] .b.t.c.SpringBootTestContextBootstrapper : Found @SpringBootConfiguration org.vaadin.addons.dramafinder.tests.TestServer for test class org.vaadin.addons.dramafinder.tests.it.GridLitRendererViewIT
[INFO] Tests run: 4, Failures: 0, Errors: 0, Skipped: 0, Time elapsed: 7.448 s -- in org.vaadin.addons.dramafinder.tests.it.GridLitRendererViewIT
[INFO] Running org.vaadin.addons.dramafinder.tests.it.NumberFieldViewIT
2026-09-21T13:45:40.889Z INFO 230151 --- [Pool-1-worker-3] t.c.s.AnnotationConfigContextLoaderUtils : Could not detect default configuration classes for test class [org.vaadin.addons.dramafinder.tests.it.NumberFieldViewIT]: NumberFieldViewIT does not declare any static, non-private, non-final, nested classes annotated with @Configuration.
2026-09-21T13:45:40.897Z INFO 230151 --- [Pool-1-worker-3] .b.t.c.SpringBootTestContextBootstrapper : Found @SpringBootConfiguration org.vaadin.addons.dramafinder.tests.TestServer for test class org.vaadin.addons.dramafinder.tests.it.NumberFieldViewIT
2026-09-21T13:45:40.897Z INFO 230151 --- [Pool-1-worker-3] t.c.s.AnnotationConfigContextLoaderUtils : Could not detect default configuration classes for test class [org.vaadin.addons.dramafinder.tests.it.NumberFieldViewIT]: NumberFieldViewIT does not declare any static, non-private, non-final, nested classes annotated with @Configuration.
2026-09-21T13:45:40.897Z INFO 230151 --- [Pool-1-worker-3] t.c.s.AnnotationConfigContextLoaderUtils : Could not detect default configuration classes for test class [org.vaadin.addons.dramafinder.tests.it.SpringPlaywrightIT]: SpringPlaywrightIT does not declare any static, non-private, non-final, nested classes annotated with @Configuration.
2026-09-21T13:45:40.898Z INFO 230151 --- [Pool-1-worker-3] t.c.s.AnnotationConfigContextLoaderUtils : Could not detect default configuration classes for test class [org.vaadin.addons.dramafinder.AbstractBasePlaywrightIT]: AbstractBasePlaywrightIT does not declare any static, non-private, non-final, nested classes annotated with @Configuration.
2026-09-21T13:45:40.898Z INFO 230151 --- [Pool-1-worker-3] .b.t.c.SpringBootTestContextBootstrapper : Found @SpringBootConfiguration org.vaadin.addons.dramafinder.tests.TestServer for test class org.vaadin.addons.dramafinder.tests.it.NumberFieldViewIT
[INFO] Tests run: 4, Failures: 0, Errors: 0, Skipped: 0, Time elapsed: 6.378 s -- in org.vaadin.addons.dramafinder.tests.it.NumberFieldViewIT
[INFO] Running org.vaadin.addons.dramafinder.tests.it.FormLayoutViewIT
2026-09-21T13:45:47.271Z INFO 230151 --- [Pool-1-worker-3] t.c.s.AnnotationConfigContextLoaderUtils : Could not detect default configuration classes for test class [org.vaadin.addons.dramafinder.tests.it.FormLayoutViewIT]: FormLayoutViewIT does not declare any static, non-private, non-final, nested classes annotated with @Configuration.
2026-09-21T13:45:47.274Z INFO 230151 --- [Pool-1-worker-3] .b.t.c.SpringBootTestContextBootstrapper : Found @SpringBootConfiguration org.vaadin.addons.dramafinder.tests.TestServer for test class org.vaadin.addons.dramafinder.tests.it.FormLayoutViewIT
2026-09-21T13:45:47.275Z INFO 230151 --- [Pool-1-worker-3] t.c.s.AnnotationConfigContextLoaderUtils : Could not detect default configuration classes for test class [org.vaadin.addons.dramafinder.tests.it.FormLayoutViewIT]: FormLayoutViewIT does not declare any static, non-private, non-final, nested classes annotated with @Configuration.
2026-09-21T13:45:47.275Z INFO 230151 --- [Pool-1-worker-3] t.c.s.AnnotationConfigContextLoaderUtils : Could not detect default configuration classes for test class [org.vaadin.addons.dramafinder.tests.it.SpringPlaywrightIT]: SpringPlaywrightIT does not declare any static, non-private, non-final, nested classes annotated with @Configuration.
2026-09-21T13:45:47.276Z INFO 230151 --- [Pool-1-worker-3] t.c.s.AnnotationConfigContextLoaderUtils : Could not detect default configuration classes for test class [org.vaadin.addons.dramafinder.AbstractBasePlaywrightIT]: AbstractBasePlaywrightIT does not declare any static, non-private, non-final, nested classes annotated with @Configuration.
2026-09-21T13:45:47.276Z INFO 230151 --- [Pool-1-worker-3] .b.t.c.SpringBootTestContextBootstrapper : Found @SpringBootConfiguration org.vaadin.addons.dramafinder.tests.TestServer for test class org.vaadin.addons.dramafinder.tests.it.FormLayoutViewIT
[INFO] Tests run: 10, Failures: 0, Errors: 0, Skipped: 0, Time elapsed: 17.62 s -- in org.vaadin.addons.dramafinder.tests.it.FormLayoutViewIT
[INFO] Running org.vaadin.addons.dramafinder.tests.it.AvatarGroupViewIT
2026-09-21T13:46:04.894Z INFO 230151 --- [Pool-1-worker-3] t.c.s.AnnotationConfigContextLoaderUtils : Could not detect default configuration classes for test class [org.vaadin.addons.dramafinder.tests.it.AvatarGroupViewIT]: AvatarGroupViewIT does not declare any static, non-private, non-final, nested classes annotated with @Configuration.
2026-09-21T13:46:04.899Z INFO 230151 --- [Pool-1-worker-3] .b.t.c.SpringBootTestContextBootstrapper : Found @SpringBootConfiguration org.vaadin.addons.dramafinder.tests.TestServer for test class org.vaadin.addons.dramafinder.tests.it.AvatarGroupViewIT
2026-09-21T13:46:04.902Z INFO 230151 --- [Pool-1-worker-3] t.c.s.AnnotationConfigContextLoaderUtils : Could not detect default configuration classes for test class [org.vaadin.addons.dramafinder.tests.it.AvatarGroupViewIT]: AvatarGroupViewIT does not declare any static, non-private, non-final, nested classes annotated with @Configuration.
2026-09-21T13:46:04.903Z INFO 230151 --- [Pool-1-worker-3] t.c.s.AnnotationConfigContextLoaderUtils : Could not detect default configuration classes for test class [org.vaadin.addons.dramafinder.tests.it.SpringPlaywrightIT]: SpringPlaywrightIT does not declare any static, non-private, non-final, nested classes annotated with @Configuration.
2026-09-21T13:46:04.903Z INFO 230151 --- [Pool-1-worker-3] t.c.s.AnnotationConfigContextLoaderUtils : Could not detect default configuration classes for test class [org.vaadin.addons.dramafinder.AbstractBasePlaywrightIT]: AbstractBasePlaywrightIT does not declare any static, non-private, non-final, nested classes annotated with @Configuration.
2026-09-21T13:46:04.906Z INFO 230151 --- [Pool-1-worker-3] .b.t.c.SpringBootTestContextBootstrapper : Found @SpringBootConfiguration org.vaadin.addons.dramafinder.tests.TestServer for test class org.vaadin.addons.dramafinder.tests.it.AvatarGroupViewIT
[INFO] Tests run: 31, Failures: 0, Errors: 0, Skipped: 0, Time elapsed: 69.86 s -- in org.vaadin.addons.dramafinder.tests.it.TreeGridSelectionViewIT
[INFO] Tests run: 20, Failures: 0, Errors: 0, Skipped: 0, Time elapsed: 28.23 s -- in org.vaadin.addons.dramafinder.tests.it.AvatarGroupViewIT
[INFO] Tests run: 38, Failures: 0, Errors: 0, Skipped: 0, Time elapsed: 208.6 s -- in org.vaadin.addons.dramafinder.tests.it.GridBasicViewIT
[INFO]
[INFO] Results:
[INFO]
[ERROR] Failures:
[ERROR] ButtonViewIT.testHasThemeVariant:50 Locator expected to have attribute 'theme'
Expected: small primary
Received: primary small
Call log:
- Assert "hasAttribute" with timeout 5000ms
- waiting for getByRole(AriaRole.BUTTON, new Page.GetByRoleOptions().setName("Combined Variants Button")).and(locator("vaadin-button"))
8 × locator resolved to Combined Variants Button
- unexpected value "primary small"
[INFO]
[ERROR] Tests run: 717, Failures: 1, Errors: 0, Skipped: 0
[INFO]
[WARNING] Corrupted channel by directly writing to native stream in forked JVM 1. See FAQ web page and the dump file /home/ghrunner/actions-runner/_work/vaadin-ecosystem-build/vaadin-ecosystem-build/work/dramafinder/target/failsafe-reports/2026-09-21T13-37-51_091-jvmRun1.dumpstream
[INFO]
[INFO] --- failsafe:3.5.4:verify (default) @ dramafinder ---
[INFO] ------------------------------------------------------------------------
[INFO] BUILD FAILURE
[INFO] ------------------------------------------------------------------------
[INFO] Total time: 09:41 min
[INFO] Finished at: 2026-09-21T13:47:21Z
[INFO] ------------------------------------------------------------------------
[ERROR] Failed to execute goal org.apache.maven.plugins:maven-failsafe-plugin:3.5.4:verify (default) on project dramafinder: There are test failures.
[ERROR]
[ERROR] See /home/ghrunner/actions-runner/_work/vaadin-ecosystem-build/vaadin-ecosystem-build/work/dramafinder/target/failsafe-reports for the individual test results.
[ERROR] See dump files (if any exist) [date].dump, [date]-jvmRun[N].dump and [date].dumpstream.
[ERROR] -> [Help 1]
[ERROR]
[ERROR] To see the full stack trace of the errors, re-run Maven with the -e switch.
[ERROR] Re-run Maven using the -X switch to enable full debug logging.
[ERROR]
[ERROR] For more information about the errors and possible solutions, please read the following articles:
[ERROR] [Help 1] http://cwiki.apache.org/confluence/display/MAVEN/MojoFailureException