fatal: couldn't find remote ref main
error: pathspec 'main' did not match any file(s) known to git
Cloning into 'dramafinder'...
$ mvn versions:set-property -Dproperty=vaadin.version -DnewVersion=25.3.0-rc1 -DgenerateBackupPoms=false -B --no-transfer-progress --settings /home/ghrunner/actions-runner/_work/vaadin-ecosystem-build/vaadin-ecosystem-build/settings.xml
[1;33mjava 25-tem is already installed.[0m
[1;32mUsing java version 25-tem in this shell.[0m
[INFO] Scanning for projects...
[INFO]
[INFO] -------------------< org.vaadin.addons:dramafinder >--------------------
[INFO] Building Drama Finder 1.1.7-SNAPSHOT
[INFO] from pom.xml
[INFO] --------------------------------[ jar ]---------------------------------
[INFO]
[INFO] --- versions:2.22.0:set-property (default-cli) @ dramafinder ---
[INFO] ------------------------------------------------------------------------
[INFO] BUILD SUCCESS
[INFO] ------------------------------------------------------------------------
[INFO] Total time: 2.016 s
[INFO] Finished at: 2026-09-20T12:02:34Z
[INFO] ------------------------------------------------------------------------
$ mvn versions:set -DnewVersion=25.3.0-rc1 -DartifactId=vaadin-bom -DgenerateBackupPoms=false -B --no-transfer-progress --settings /home/ghrunner/actions-runner/_work/vaadin-ecosystem-build/vaadin-ecosystem-build/settings.xml
[1;33mjava 25-tem is already installed.[0m
[1;32mUsing java version 25-tem in this shell.[0m
[INFO] Scanning for projects...
[INFO]
[INFO] -------------------< org.vaadin.addons:dramafinder >--------------------
[INFO] Building Drama Finder 1.1.7-SNAPSHOT
[INFO] from pom.xml
[INFO] --------------------------------[ jar ]---------------------------------
[INFO]
[INFO] --- versions:2.22.0:set (default-cli) @ dramafinder ---
[INFO] Searching for local aggregator root...
[INFO] Local aggregation root: /home/ghrunner/actions-runner/_work/vaadin-ecosystem-build/vaadin-ecosystem-build/work/dramafinder
[INFO] Processing change of org.vaadin.addons:vaadin-bom:1.1.7-SNAPSHOT -> 25.3.0-rc1
[INFO] ------------------------------------------------------------------------
[INFO] BUILD SUCCESS
[INFO] ------------------------------------------------------------------------
[INFO] Total time: 1.531 s
[INFO] Finished at: 2026-09-20T12:02:38Z
[INFO] ------------------------------------------------------------------------
$ mvn clean verify -B --no-transfer-progress --settings /home/ghrunner/actions-runner/_work/vaadin-ecosystem-build/vaadin-ecosystem-build/settings.xml
[1;33mjava 25-tem is already installed.[0m
[1;32mUsing java version 25-tem in this shell.[0m
[INFO] Scanning for projects...
[INFO]
[INFO] -------------------< org.vaadin.addons:dramafinder >--------------------
[INFO] Building Drama Finder 1.1.7-SNAPSHOT
[INFO] from pom.xml
[INFO] --------------------------------[ jar ]---------------------------------
[INFO]
[INFO] --- clean:3.2.0:clean (default-clean) @ dramafinder ---
[INFO]
[INFO] --- jacoco:0.8.14:prepare-agent (default) @ dramafinder ---
[INFO] argLine set to -javaagent:/home/ghrunner/.m2/repository/org/jacoco/org.jacoco.agent/0.8.14/org.jacoco.agent-0.8.14-runtime.jar=destfile=/home/ghrunner/actions-runner/_work/vaadin-ecosystem-build/vaadin-ecosystem-build/work/dramafinder/target/jacoco.exec
[INFO]
[INFO] --- resources:3.3.1:copy-resources (bundle-agent-docs) @ dramafinder ---
[INFO] Copying 1 resource from skills/vaadin-playwright-test to target/classes/META-INF/dramafinder
[INFO] Copying 1 resource from skills/vaadin-playwright-screenshot to target/classes/META-INF/dramafinder
[INFO]
[INFO] --- resources:3.3.1:resources (default-resources) @ dramafinder ---
[INFO] Copying 1 resource from src/main/resources to target/classes
[INFO]
[INFO] --- compiler:3.13.0:compile (default-compile) @ dramafinder ---
[INFO] Recompiling the module because of changed source code.
[INFO] Compiling 90 source files with javac [debug release 21] to target/classes
[INFO]
[INFO] --- resources:3.3.1:testResources (default-testResources) @ dramafinder ---
[INFO] Copying 3 resources from src/test/resources to target/test-classes
[INFO]
[INFO] --- compiler:3.13.0:testCompile (default-testCompile) @ dramafinder ---
[INFO] Recompiling the module because of changed dependency.
[INFO] Compiling 150 source files with javac [debug release 21] to target/test-classes
[WARNING] /home/ghrunner/actions-runner/_work/vaadin-ecosystem-build/vaadin-ecosystem-build/work/dramafinder/src/test/java/org/vaadin/addons/dramafinder/tests/testuis/ButtonView.java:[72,34] BUTTON in com.vaadin.flow.component.icon.VaadinIcon has been deprecated and marked for removal
[WARNING] /home/ghrunner/actions-runner/_work/vaadin-ecosystem-build/vaadin-ecosystem-build/work/dramafinder/src/test/java/org/vaadin/addons/dramafinder/tests/testuis/DialogView.java:[64,15] setModal(boolean) in com.vaadin.flow.component.dialog.Dialog has been deprecated and marked for removal
[WARNING] /home/ghrunner/actions-runner/_work/vaadin-ecosystem-build/vaadin-ecosystem-build/work/dramafinder/src/test/java/org/vaadin/addons/dramafinder/tests/testuis/LoginFormView.java:[52,35] createDefault() in com.vaadin.flow.component.login.LoginI18n has been deprecated and marked for removal
[WARNING] /home/ghrunner/actions-runner/_work/vaadin-ecosystem-build/vaadin-ecosystem-build/work/dramafinder/src/test/java/org/vaadin/addons/dramafinder/tests/testuis/LoginOverlayView.java:[54,35] createDefault() in com.vaadin.flow.component.login.LoginI18n has been deprecated and marked for removal
[WARNING] /home/ghrunner/actions-runner/_work/vaadin-ecosystem-build/vaadin-ecosystem-build/work/dramafinder/src/test/java/org/vaadin/addons/dramafinder/tests/testuis/SideNavigationElementView.java:[30,44] ACCORDION_MENU in com.vaadin.flow.component.icon.VaadinIcon has been deprecated and marked for removal
[INFO] /home/ghrunner/actions-runner/_work/vaadin-ecosystem-build/vaadin-ecosystem-build/work/dramafinder/src/test/java/org/vaadin/addons/dramafinder/tests/testuis/TreeGridView.java: Some input files use or override a deprecated API.
[INFO] /home/ghrunner/actions-runner/_work/vaadin-ecosystem-build/vaadin-ecosystem-build/work/dramafinder/src/test/java/org/vaadin/addons/dramafinder/tests/testuis/TreeGridView.java: Recompile with -Xlint:deprecation for details.
[INFO]
[INFO] --- surefire:3.2.5:test (default-test) @ dramafinder ---
[INFO] Using auto detected provider org.apache.maven.surefire.junitplatform.JUnitPlatformProvider
[INFO]
[INFO] -------------------------------------------------------
[INFO] T E S T S
[INFO] -------------------------------------------------------
[INFO] Running org.vaadin.addons.dramafinder.DocumentationBundledInJarTest
[INFO] Running org.vaadin.addons.dramafinder.element.utils.NumberUtilsTest
[INFO] Tests run: 8, Failures: 0, Errors: 0, Skipped: 0, Time elapsed: 0.122 s -- in org.vaadin.addons.dramafinder.DocumentationBundledInJarTest
[INFO] Tests run: 0, Failures: 0, Errors: 0, Skipped: 0, Time elapsed: 0.126 s -- in org.vaadin.addons.dramafinder.element.utils.NumberUtilsTest
[INFO]
[INFO] Results:
[INFO]
[INFO] Tests run: 8, Failures: 0, Errors: 0, Skipped: 0
[INFO]
[INFO]
[INFO] --- jacoco:0.8.14:report (report) @ dramafinder ---
[INFO] Loading execution data file /home/ghrunner/actions-runner/_work/vaadin-ecosystem-build/vaadin-ecosystem-build/work/dramafinder/target/jacoco.exec
[INFO] Analyzed bundle 'Drama Finder' with 94 classes
[INFO]
[INFO] --- jar:3.4.2:jar (default-jar) @ dramafinder ---
[INFO] Building jar: /home/ghrunner/actions-runner/_work/vaadin-ecosystem-build/vaadin-ecosystem-build/work/dramafinder/target/dramafinder-1.1.7-SNAPSHOT.jar
[INFO]
[INFO] --- failsafe:3.5.4:integration-test (default) @ dramafinder ---
[INFO] Using auto detected provider org.apache.maven.surefire.junitplatform.JUnitPlatformProvider
[INFO]
[INFO] -------------------------------------------------------
[INFO] T E S T S
[INFO] -------------------------------------------------------
[INFO] Running org.vaadin.addons.dramafinder.tests.it.TimePickerViewIT
[INFO] Running org.vaadin.addons.dramafinder.tests.it.SimpleExampleViewIT
12:02:58.883 [ForkJoinPool-1-worker-1] INFO org.springframework.test.context.support.AnnotationConfigContextLoaderUtils -- Could not detect default configuration classes for test class [org.vaadin.addons.dramafinder.tests.it.SimpleExampleViewIT]: SimpleExampleViewIT does not declare any static, non-private, non-final, nested classes annotated with @Configuration.
12:02:58.883 [ForkJoinPool-1-worker-2] INFO org.springframework.test.context.support.AnnotationConfigContextLoaderUtils -- Could not detect default configuration classes for test class [org.vaadin.addons.dramafinder.tests.it.TimePickerViewIT]: TimePickerViewIT does not declare any static, non-private, non-final, nested classes annotated with @Configuration.
12:02:59.241 [ForkJoinPool-1-worker-2] INFO org.springframework.boot.test.context.SpringBootTestContextBootstrapper -- Found @SpringBootConfiguration org.vaadin.addons.dramafinder.tests.TestServer for test class org.vaadin.addons.dramafinder.tests.it.TimePickerViewIT
12:02:59.241 [ForkJoinPool-1-worker-1] INFO org.springframework.boot.test.context.SpringBootTestContextBootstrapper -- Found @SpringBootConfiguration org.vaadin.addons.dramafinder.tests.TestServer for test class org.vaadin.addons.dramafinder.tests.it.SimpleExampleViewIT
12:02:59.511 [ForkJoinPool-1-worker-2] INFO org.springframework.test.context.support.AnnotationConfigContextLoaderUtils -- Could not detect default configuration classes for test class [org.vaadin.addons.dramafinder.tests.it.TimePickerViewIT]: TimePickerViewIT does not declare any static, non-private, non-final, nested classes annotated with @Configuration.
12:02:59.511 [ForkJoinPool-1-worker-1] INFO org.springframework.test.context.support.AnnotationConfigContextLoaderUtils -- Could not detect default configuration classes for test class [org.vaadin.addons.dramafinder.tests.it.SimpleExampleViewIT]: SimpleExampleViewIT does not declare any static, non-private, non-final, nested classes annotated with @Configuration.
12:02:59.512 [ForkJoinPool-1-worker-1] INFO org.springframework.test.context.support.AnnotationConfigContextLoaderUtils -- Could not detect default configuration classes for test class [org.vaadin.addons.dramafinder.tests.it.SpringPlaywrightIT]: SpringPlaywrightIT does not declare any static, non-private, non-final, nested classes annotated with @Configuration.
12:02:59.513 [ForkJoinPool-1-worker-1] INFO org.springframework.test.context.support.AnnotationConfigContextLoaderUtils -- Could not detect default configuration classes for test class [org.vaadin.addons.dramafinder.AbstractBasePlaywrightIT]: AbstractBasePlaywrightIT does not declare any static, non-private, non-final, nested classes annotated with @Configuration.
12:02:59.514 [ForkJoinPool-1-worker-2] INFO org.springframework.test.context.support.AnnotationConfigContextLoaderUtils -- Could not detect default configuration classes for test class [org.vaadin.addons.dramafinder.tests.it.SpringPlaywrightIT]: SpringPlaywrightIT does not declare any static, non-private, non-final, nested classes annotated with @Configuration.
12:02:59.514 [ForkJoinPool-1-worker-2] INFO org.springframework.test.context.support.AnnotationConfigContextLoaderUtils -- Could not detect default configuration classes for test class [org.vaadin.addons.dramafinder.AbstractBasePlaywrightIT]: AbstractBasePlaywrightIT does not declare any static, non-private, non-final, nested classes annotated with @Configuration.
12:02:59.516 [ForkJoinPool-1-worker-2] INFO org.springframework.boot.test.context.SpringBootTestContextBootstrapper -- Found @SpringBootConfiguration org.vaadin.addons.dramafinder.tests.TestServer for test class org.vaadin.addons.dramafinder.tests.it.TimePickerViewIT
12:02:59.524 [ForkJoinPool-1-worker-1] INFO org.springframework.boot.test.context.SpringBootTestContextBootstrapper -- Found @SpringBootConfiguration org.vaadin.addons.dramafinder.tests.TestServer for test class org.vaadin.addons.dramafinder.tests.it.SimpleExampleViewIT
. ____ _ __ _ _
/\\ / ___'_ __ _ _(_)_ __ __ _ \ \ \ \
( ( )\___ | '_ | '_| | '_ \/ _` | \ \ \ \
\\/ ___)| |_)| | | | | || (_| | ) ) ) )
' |____| .__|_| |_|_| |_\__, | / / / /
=========|_|==============|___/=/_/_/_/
:: Spring Boot :: (v4.1.1)
2026-09-20T12:03:02.171Z INFO 3845258 --- [Pool-1-worker-1] o.v.a.d.tests.it.SimpleExampleViewIT : Starting SimpleExampleViewIT using Java 25 with PID 3845258 (started by ghrunner in /home/ghrunner/actions-runner/_work/vaadin-ecosystem-build/vaadin-ecosystem-build/work/dramafinder)
2026-09-20T12:03:02.173Z INFO 3845258 --- [Pool-1-worker-1] o.v.a.d.tests.it.SimpleExampleViewIT : No active profile set, falling back to 1 default profile: "default"
2026-09-20T12:03:03.720Z INFO 3845258 --- [Pool-1-worker-1] o.s.boot.tomcat.TomcatWebServer : Tomcat initialized with port 0 (http)
2026-09-20T12:03:03.750Z INFO 3845258 --- [Pool-1-worker-1] o.apache.catalina.core.StandardService : Starting service [Tomcat]
2026-09-20T12:03:03.751Z INFO 3845258 --- [Pool-1-worker-1] o.apache.catalina.core.StandardEngine : Starting Servlet engine: [Apache Tomcat/11.0.25]
2026-09-20T12:03:03.805Z INFO 3845258 --- [Pool-1-worker-1] b.w.c.s.WebApplicationContextInitializer : Root WebApplicationContext: initialization completed in 1594 ms
2026-09-20T12:03:07.123Z INFO 3845258 --- [Pool-1-worker-1] c.v.f.s.VaadinServletContextInitializer : Search for subclasses and classes with annotations took 2799 ms
2026-09-20T12:03:07.133Z WARN 3845258 --- [Pool-1-worker-1] com.vaadin.experimental.FeatureFlags : Unsupported feature flag is present: com.vaadin.experimental.switchComponent
2026-09-20T12:03:07.134Z WARN 3845258 --- [Pool-1-worker-1] com.vaadin.experimental.FeatureFlags : Unsupported feature flag is present: com.vaadin.experimental.breadcrumbsComponent
2026-09-20T12:03:07.368Z INFO 3845258 --- [Pool-1-worker-1] c.v.b.d.startup.DevModeStartupListener : Starting dev-mode updaters in /home/ghrunner/actions-runner/_work/vaadin-ecosystem-build/vaadin-ecosystem-build/work/dramafinder folder.
2026-09-20T12:03:07.430Z WARN 3845258 --- [Pool-1-worker-1] com.vaadin.experimental.FeatureFlags : Unsupported feature flag is present: com.vaadin.experimental.switchComponent
2026-09-20T12:03:07.430Z WARN 3845258 --- [Pool-1-worker-1] com.vaadin.experimental.FeatureFlags : Unsupported feature flag is present: com.vaadin.experimental.breadcrumbsComponent
2026-09-20T12:03:07.479Z INFO 3845258 --- [Pool-1-worker-1] c.v.f.s.f.s.FullDependenciesScanner : Visited 107 classes. Took 41 ms.
2026-09-20T12:03:07.520Z INFO 3845258 --- [Pool-1-worker-1] c.v.f.s.frontend.BundleValidationUtil : Checking if a development mode bundle build is needed
2026-09-20T12:03:07.765Z INFO 3845258 --- [Pool-1-worker-1] c.v.f.s.frontend.BundleValidationUtil : A development mode bundle build is not needed
2026-09-20T12:03:07.861Z INFO 3845258 --- [in-dev-server-1] c.v.f.s.frontend.TaskCopyFrontendFiles : Copying frontend resources from jar files ...
2026-09-20T12:03:08.172Z INFO 3845258 --- [in-dev-server-1] c.v.f.s.frontend.TaskCopyFrontendFiles : Visited 19 resources. Took 311 ms.
2026-09-20T12:03:09.423Z INFO 3845258 --- [Pool-1-worker-1] org.atmosphere.cpr.AtmosphereFramework : Installed AtmosphereHandler com.vaadin.flow.server.communication.PushAtmosphereHandler mapped to context-path: /*
2026-09-20T12:03:09.424Z INFO 3845258 --- [Pool-1-worker-1] org.atmosphere.cpr.AtmosphereFramework : Installed the following AtmosphereInterceptor mapped to AtmosphereHandler com.vaadin.flow.server.communication.PushAtmosphereHandler
2026-09-20T12:03:09.510Z INFO 3845258 --- [Pool-1-worker-1] org.atmosphere.cpr.AtmosphereFramework : Atmosphere is using org.atmosphere.util.VoidAnnotationProcessor for processing annotation
2026-09-20T12:03:09.525Z INFO 3845258 --- [Pool-1-worker-1] org.atmosphere.util.ForkJoinPool : Using ForkJoinPool java.util.concurrent.ForkJoinPool. Set the org.atmosphere.cpr.broadcaster.maxAsyncWriteThreads to -1 to fully use its power.
2026-09-20T12:03:09.533Z INFO 3845258 --- [Pool-1-worker-1] org.atmosphere.cpr.AtmosphereFramework : Installed WebSocketProtocol org.atmosphere.websocket.protocol.SimpleHttpProtocol
2026-09-20T12:03:09.540Z INFO 3845258 --- [Pool-1-worker-1] o.a.container.JSR356AsyncSupport : JSR 356 Mapping path /VAADIN/push
2026-09-20T12:03:09.570Z INFO 3845258 --- [Pool-1-worker-1] org.atmosphere.cpr.AtmosphereFramework : Installing Default AtmosphereInterceptors
2026-09-20T12:03:09.570Z INFO 3845258 --- [Pool-1-worker-1] org.atmosphere.cpr.AtmosphereFramework : org.atmosphere.interceptor.CorsInterceptor : CORS Interceptor Support
2026-09-20T12:03:09.571Z INFO 3845258 --- [Pool-1-worker-1] org.atmosphere.cpr.AtmosphereFramework : org.atmosphere.interceptor.CacheHeadersInterceptor : Default Response's Headers Interceptor
2026-09-20T12:03:09.571Z INFO 3845258 --- [Pool-1-worker-1] org.atmosphere.cpr.AtmosphereFramework : org.atmosphere.interceptor.PaddingAtmosphereInterceptor : Browser Padding Interceptor Support
2026-09-20T12:03:09.572Z INFO 3845258 --- [Pool-1-worker-1] org.atmosphere.cpr.AtmosphereFramework : org.atmosphere.interceptor.AndroidAtmosphereInterceptor : Android Interceptor Support
2026-09-20T12:03:09.572Z INFO 3845258 --- [Pool-1-worker-1] org.atmosphere.cpr.AtmosphereFramework : org.atmosphere.interceptor.HeartbeatInterceptor : Heartbeat Interceptor Support
2026-09-20T12:03:09.573Z INFO 3845258 --- [Pool-1-worker-1] org.atmosphere.cpr.AtmosphereFramework : org.atmosphere.interceptor.SSEAtmosphereInterceptor : SSE Interceptor Support
2026-09-20T12:03:09.573Z INFO 3845258 --- [Pool-1-worker-1] org.atmosphere.cpr.AtmosphereFramework : org.atmosphere.interceptor.JSONPAtmosphereInterceptor : JSONP Interceptor Support
2026-09-20T12:03:09.574Z INFO 3845258 --- [Pool-1-worker-1] org.atmosphere.cpr.AtmosphereFramework : org.atmosphere.interceptor.JavaScriptProtocol : Atmosphere JavaScript Protocol
2026-09-20T12:03:09.574Z INFO 3845258 --- [Pool-1-worker-1] org.atmosphere.cpr.AtmosphereFramework : org.atmosphere.interceptor.WebSocketMessageSuspendInterceptor : org.atmosphere.interceptor.WebSocketMessageSuspendInterceptor
2026-09-20T12:03:09.575Z INFO 3845258 --- [Pool-1-worker-1] org.atmosphere.cpr.AtmosphereFramework : org.atmosphere.interceptor.OnDisconnectInterceptor : Browser disconnection detection
2026-09-20T12:03:09.575Z INFO 3845258 --- [Pool-1-worker-1] org.atmosphere.cpr.AtmosphereFramework : org.atmosphere.interceptor.IdleResourceInterceptor : org.atmosphere.interceptor.IdleResourceInterceptor
2026-09-20T12:03:09.575Z INFO 3845258 --- [Pool-1-worker-1] org.atmosphere.cpr.AtmosphereFramework : Set org.atmosphere.cpr.AtmosphereInterceptor.disableDefaults to disable them.
2026-09-20T12:03:09.576Z INFO 3845258 --- [Pool-1-worker-1] org.atmosphere.cpr.AtmosphereFramework : Installed AtmosphereInterceptor CORS Interceptor Support with priority FIRST_BEFORE_DEFAULT
2026-09-20T12:03:09.582Z INFO 3845258 --- [Pool-1-worker-1] org.atmosphere.cpr.AtmosphereFramework : Installed AtmosphereInterceptor Default Response's Headers Interceptor with priority AFTER_DEFAULT
2026-09-20T12:03:09.582Z INFO 3845258 --- [Pool-1-worker-1] org.atmosphere.cpr.AtmosphereFramework : Installed AtmosphereInterceptor Browser Padding Interceptor Support with priority AFTER_DEFAULT
2026-09-20T12:03:09.582Z INFO 3845258 --- [Pool-1-worker-1] org.atmosphere.cpr.AtmosphereFramework : Installed AtmosphereInterceptor Android Interceptor Support with priority AFTER_DEFAULT
2026-09-20T12:03:09.583Z INFO 3845258 --- [Pool-1-worker-1] o.a.interceptor.HeartbeatInterceptor : HeartbeatInterceptor configured with padding value 'X', client frequency 0 seconds and server frequency 60 seconds
2026-09-20T12:03:09.583Z INFO 3845258 --- [Pool-1-worker-1] org.atmosphere.cpr.AtmosphereFramework : Installed AtmosphereInterceptor Heartbeat Interceptor Support with priority AFTER_DEFAULT
2026-09-20T12:03:09.583Z INFO 3845258 --- [Pool-1-worker-1] org.atmosphere.cpr.AtmosphereFramework : Installed AtmosphereInterceptor SSE Interceptor Support with priority AFTER_DEFAULT
2026-09-20T12:03:09.585Z INFO 3845258 --- [Pool-1-worker-1] org.atmosphere.cpr.AtmosphereFramework : Installed AtmosphereInterceptor JSONP Interceptor Support with priority AFTER_DEFAULT
2026-09-20T12:03:09.585Z INFO 3845258 --- [Pool-1-worker-1] org.atmosphere.cpr.AtmosphereFramework : Installed AtmosphereInterceptor Atmosphere JavaScript Protocol with priority AFTER_DEFAULT
2026-09-20T12:03:09.585Z INFO 3845258 --- [Pool-1-worker-1] org.atmosphere.cpr.AtmosphereFramework : Installed AtmosphereInterceptor org.atmosphere.interceptor.WebSocketMessageSuspendInterceptor with priority AFTER_DEFAULT
2026-09-20T12:03:09.585Z INFO 3845258 --- [Pool-1-worker-1] org.atmosphere.cpr.AtmosphereFramework : Installed AtmosphereInterceptor Browser disconnection detection with priority AFTER_DEFAULT
2026-09-20T12:03:09.585Z INFO 3845258 --- [Pool-1-worker-1] org.atmosphere.cpr.AtmosphereFramework : Installed AtmosphereInterceptor org.atmosphere.interceptor.IdleResourceInterceptor with priority BEFORE_DEFAULT
2026-09-20T12:03:09.586Z INFO 3845258 --- [Pool-1-worker-1] org.atmosphere.cpr.AtmosphereFramework : Using EndpointMapper class org.atmosphere.util.DefaultEndpointMapper
2026-09-20T12:03:09.586Z INFO 3845258 --- [Pool-1-worker-1] org.atmosphere.cpr.AtmosphereFramework : Using BroadcasterCache: org.atmosphere.cache.UUIDBroadcasterCache
2026-09-20T12:03:09.586Z INFO 3845258 --- [Pool-1-worker-1] org.atmosphere.cpr.AtmosphereFramework : Default Broadcaster Class: org.atmosphere.cpr.DefaultBroadcaster
2026-09-20T12:03:09.586Z INFO 3845258 --- [Pool-1-worker-1] org.atmosphere.cpr.AtmosphereFramework : Broadcaster Shared List Resources: false
2026-09-20T12:03:09.586Z INFO 3845258 --- [Pool-1-worker-1] org.atmosphere.cpr.AtmosphereFramework : Broadcaster Polling Wait Time 100
2026-09-20T12:03:09.586Z INFO 3845258 --- [Pool-1-worker-1] org.atmosphere.cpr.AtmosphereFramework : Shared ExecutorService supported: true
2026-09-20T12:03:09.586Z INFO 3845258 --- [Pool-1-worker-1] org.atmosphere.cpr.AtmosphereFramework : Messaging ExecutorService Pool Size unavailable - Not instance of ThreadPoolExecutor
2026-09-20T12:03:09.586Z INFO 3845258 --- [Pool-1-worker-1] org.atmosphere.cpr.AtmosphereFramework : Async I/O Thread Pool Size: 200
2026-09-20T12:03:09.587Z INFO 3845258 --- [Pool-1-worker-1] org.atmosphere.cpr.AtmosphereFramework : Using BroadcasterFactory: org.atmosphere.cpr.DefaultBroadcasterFactory
2026-09-20T12:03:09.587Z INFO 3845258 --- [Pool-1-worker-1] org.atmosphere.cpr.AtmosphereFramework : Using AtmosphereResurceFactory: org.atmosphere.cpr.DefaultAtmosphereResourceFactory
2026-09-20T12:03:09.587Z INFO 3845258 --- [Pool-1-worker-1] org.atmosphere.cpr.AtmosphereFramework : Using WebSocketProcessor: org.atmosphere.websocket.DefaultWebSocketProcessor
2026-09-20T12:03:09.591Z INFO 3845258 --- [Pool-1-worker-1] org.atmosphere.cpr.AtmosphereFramework : Invoke AtmosphereInterceptor on WebSocket message true
2026-09-20T12:03:09.591Z INFO 3845258 --- [Pool-1-worker-1] org.atmosphere.cpr.AtmosphereFramework : HttpSession supported: true
2026-09-20T12:03:09.591Z INFO 3845258 --- [Pool-1-worker-1] org.atmosphere.cpr.AtmosphereFramework : Atmosphere is using DefaultAtmosphereObjectFactory for dependency injection and object creation
2026-09-20T12:03:09.591Z INFO 3845258 --- [Pool-1-worker-1] org.atmosphere.cpr.AtmosphereFramework : Atmosphere is using async support: org.atmosphere.container.JSR356AsyncSupport running under container: Apache Tomcat/11.0.25 using jakarta.servlet/3.0 and jsr356/WebSocket API
2026-09-20T12:03:09.592Z INFO 3845258 --- [Pool-1-worker-1] org.atmosphere.cpr.AtmosphereFramework : Atmosphere Framework 3.0.5.slf4jvaadin1 started.
2026-09-20T12:03:09.600Z INFO 3845258 --- [Pool-1-worker-1] org.atmosphere.cpr.AtmosphereFramework : Installed AtmosphereInterceptor Track Message Size Interceptor using | with priority BEFORE_DEFAULT
2026-09-20T12:03:09.689Z INFO 3845258 --- [Pool-1-worker-1] c.v.f.s.DefaultDeploymentConfiguration :
Vaadin is running in DEVELOPMENT mode - do not use for production deployments.
2026-09-20T12:03:09.744Z INFO 3845258 --- [Pool-1-worker-1] c.vaadin.copilot.CopilotIndexHtmlLoader : Copilot is disabled
2026-09-20T12:03:09.780Z INFO 3845258 --- [Pool-1-worker-1] o.s.boot.tomcat.TomcatWebServer : Tomcat started on port 42573 (http) with context path '/'
2026-09-20T12:03:09.786Z INFO 3845258 --- [Pool-1-worker-1] o.v.a.d.tests.it.SimpleExampleViewIT : Started SimpleExampleViewIT in 8.055 seconds (process running for 13.383)
2026-09-20T12:03:09.792Z INFO 3845258 --- [Pool-1-worker-1] c.v.b.d.DevModeHandlerManagerImpl : Application running at http://localhost:0/
Mockito is currently self-attaching to enable the inline-mock-maker. This will no longer work in future releases of the JDK. Please add Mockito as an agent to your build as described in Mockito's documentation: https://javadoc.io/doc/org.mockito/mockito-core/latest/org.mockito/org/mockito/Mockito.html#0.3
[INFO] Running org.vaadin.addons.dramafinder.tests.it.TabsViewIT
2026-09-20T12:03:09.884Z INFO 3845258 --- [Pool-1-worker-3] t.c.s.AnnotationConfigContextLoaderUtils : Could not detect default configuration classes for test class [org.vaadin.addons.dramafinder.tests.it.TabsViewIT]: TabsViewIT does not declare any static, non-private, non-final, nested classes annotated with @Configuration.
2026-09-20T12:03:09.889Z INFO 3845258 --- [Pool-1-worker-3] .b.t.c.SpringBootTestContextBootstrapper : Found @SpringBootConfiguration org.vaadin.addons.dramafinder.tests.TestServer for test class org.vaadin.addons.dramafinder.tests.it.TabsViewIT
2026-09-20T12:03:09.891Z INFO 3845258 --- [Pool-1-worker-3] t.c.s.AnnotationConfigContextLoaderUtils : Could not detect default configuration classes for test class [org.vaadin.addons.dramafinder.tests.it.TabsViewIT]: TabsViewIT does not declare any static, non-private, non-final, nested classes annotated with @Configuration.
2026-09-20T12:03:09.892Z INFO 3845258 --- [Pool-1-worker-3] t.c.s.AnnotationConfigContextLoaderUtils : Could not detect default configuration classes for test class [org.vaadin.addons.dramafinder.tests.it.SpringPlaywrightIT]: SpringPlaywrightIT does not declare any static, non-private, non-final, nested classes annotated with @Configuration.
2026-09-20T12:03:09.893Z INFO 3845258 --- [Pool-1-worker-3] t.c.s.AnnotationConfigContextLoaderUtils : Could not detect default configuration classes for test class [org.vaadin.addons.dramafinder.AbstractBasePlaywrightIT]: AbstractBasePlaywrightIT does not declare any static, non-private, non-final, nested classes annotated with @Configuration.
2026-09-20T12:03:09.895Z INFO 3845258 --- [Pool-1-worker-3] .b.t.c.SpringBootTestContextBootstrapper : Found @SpringBootConfiguration org.vaadin.addons.dramafinder.tests.TestServer for test class org.vaadin.addons.dramafinder.tests.it.TabsViewIT
OpenJDK 64-Bit Server VM warning: Sharing is only supported for boot loader classes because bootstrap classpath has been appended
WARNING: A Java agent has been loaded dynamically (/home/ghrunner/.m2/repository/net/bytebuddy/byte-buddy-agent/1.18.11/byte-buddy-agent-1.18.11.jar)
WARNING: If a serviceability tool is in use, please run with -XX:+EnableDynamicAgentLoading to hide this warning
WARNING: If a serviceability tool is not in use, please run with -Djdk.instrument.traceUsage for more information
WARNING: Dynamic loading of agents will be disallowed by default in a future release
2026-09-20T12:03:11.526Z INFO 3845258 --- [o-auto-1-exec-1] o.a.c.c.C.[Tomcat].[localhost].[/] : Initializing Spring DispatcherServlet 'dispatcherServlet'
2026-09-20T12:03:11.527Z INFO 3845258 --- [o-auto-1-exec-1] o.s.web.servlet.DispatcherServlet : Initializing Servlet 'dispatcherServlet'
2026-09-20T12:03:11.528Z INFO 3845258 --- [o-auto-1-exec-1] o.s.web.servlet.DispatcherServlet : Completed initialization in 1 ms
[INFO] Tests run: 1, Failures: 0, Errors: 0, Skipped: 0, Time elapsed: 16.78 s -- in org.vaadin.addons.dramafinder.tests.it.SimpleExampleViewIT
[INFO] Running org.vaadin.addons.dramafinder.tests.it.TreeGridExpandCollapseViewIT
2026-09-20T12:03:15.221Z INFO 3845258 --- [Pool-1-worker-1] t.c.s.AnnotationConfigContextLoaderUtils : Could not detect default configuration classes for test class [org.vaadin.addons.dramafinder.tests.it.TreeGridExpandCollapseViewIT]: TreeGridExpandCollapseViewIT does not declare any static, non-private, non-final, nested classes annotated with @Configuration.
2026-09-20T12:03:15.230Z INFO 3845258 --- [Pool-1-worker-1] .b.t.c.SpringBootTestContextBootstrapper : Found @SpringBootConfiguration org.vaadin.addons.dramafinder.tests.TestServer for test class org.vaadin.addons.dramafinder.tests.it.TreeGridExpandCollapseViewIT
2026-09-20T12:03:15.248Z INFO 3845258 --- [Pool-1-worker-1] t.c.s.AnnotationConfigContextLoaderUtils : Could not detect default configuration classes for test class [org.vaadin.addons.dramafinder.tests.it.TreeGridExpandCollapseViewIT]: TreeGridExpandCollapseViewIT does not declare any static, non-private, non-final, nested classes annotated with @Configuration.
2026-09-20T12:03:15.249Z INFO 3845258 --- [Pool-1-worker-1] t.c.s.AnnotationConfigContextLoaderUtils : Could not detect default configuration classes for test class [org.vaadin.addons.dramafinder.tests.it.SpringPlaywrightIT]: SpringPlaywrightIT does not declare any static, non-private, non-final, nested classes annotated with @Configuration.
2026-09-20T12:03:15.249Z INFO 3845258 --- [Pool-1-worker-1] t.c.s.AnnotationConfigContextLoaderUtils : Could not detect default configuration classes for test class [org.vaadin.addons.dramafinder.AbstractBasePlaywrightIT]: AbstractBasePlaywrightIT does not declare any static, non-private, non-final, nested classes annotated with @Configuration.
2026-09-20T12:03:15.250Z INFO 3845258 --- [Pool-1-worker-1] .b.t.c.SpringBootTestContextBootstrapper : Found @SpringBootConfiguration org.vaadin.addons.dramafinder.tests.TestServer for test class org.vaadin.addons.dramafinder.tests.it.TreeGridExpandCollapseViewIT
[INFO] Tests run: 6, Failures: 0, Errors: 0, Skipped: 0, Time elapsed: 15.88 s -- in org.vaadin.addons.dramafinder.tests.it.TabsViewIT
[INFO] Running org.vaadin.addons.dramafinder.tests.it.GridFooterViewIT
2026-09-20T12:03:25.766Z INFO 3845258 --- [Pool-1-worker-3] t.c.s.AnnotationConfigContextLoaderUtils : Could not detect default configuration classes for test class [org.vaadin.addons.dramafinder.tests.it.GridFooterViewIT]: GridFooterViewIT does not declare any static, non-private, non-final, nested classes annotated with @Configuration.
2026-09-20T12:03:25.768Z INFO 3845258 --- [Pool-1-worker-3] .b.t.c.SpringBootTestContextBootstrapper : Found @SpringBootConfiguration org.vaadin.addons.dramafinder.tests.TestServer for test class org.vaadin.addons.dramafinder.tests.it.GridFooterViewIT
2026-09-20T12:03:25.781Z INFO 3845258 --- [Pool-1-worker-3] t.c.s.AnnotationConfigContextLoaderUtils : Could not detect default configuration classes for test class [org.vaadin.addons.dramafinder.tests.it.GridFooterViewIT]: GridFooterViewIT does not declare any static, non-private, non-final, nested classes annotated with @Configuration.
2026-09-20T12:03:25.782Z INFO 3845258 --- [Pool-1-worker-3] t.c.s.AnnotationConfigContextLoaderUtils : Could not detect default configuration classes for test class [org.vaadin.addons.dramafinder.tests.it.SpringPlaywrightIT]: SpringPlaywrightIT does not declare any static, non-private, non-final, nested classes annotated with @Configuration.
2026-09-20T12:03:25.783Z INFO 3845258 --- [Pool-1-worker-3] t.c.s.AnnotationConfigContextLoaderUtils : Could not detect default configuration classes for test class [org.vaadin.addons.dramafinder.AbstractBasePlaywrightIT]: AbstractBasePlaywrightIT does not declare any static, non-private, non-final, nested classes annotated with @Configuration.
2026-09-20T12:03:25.784Z INFO 3845258 --- [Pool-1-worker-3] .b.t.c.SpringBootTestContextBootstrapper : Found @SpringBootConfiguration org.vaadin.addons.dramafinder.tests.TestServer for test class org.vaadin.addons.dramafinder.tests.it.GridFooterViewIT
[INFO] Tests run: 9, Failures: 0, Errors: 0, Skipped: 0, Time elapsed: 32.39 s -- in org.vaadin.addons.dramafinder.tests.it.TimePickerViewIT
[INFO] Running org.vaadin.addons.dramafinder.tests.it.MultiSelectComboBoxViewIT
2026-09-20T12:03:30.820Z INFO 3845258 --- [Pool-1-worker-2] t.c.s.AnnotationConfigContextLoaderUtils : Could not detect default configuration classes for test class [org.vaadin.addons.dramafinder.tests.it.MultiSelectComboBoxViewIT]: MultiSelectComboBoxViewIT does not declare any static, non-private, non-final, nested classes annotated with @Configuration.
2026-09-20T12:03:30.826Z INFO 3845258 --- [Pool-1-worker-2] .b.t.c.SpringBootTestContextBootstrapper : Found @SpringBootConfiguration org.vaadin.addons.dramafinder.tests.TestServer for test class org.vaadin.addons.dramafinder.tests.it.MultiSelectComboBoxViewIT
2026-09-20T12:03:30.827Z INFO 3845258 --- [Pool-1-worker-2] t.c.s.AnnotationConfigContextLoaderUtils : Could not detect default configuration classes for test class [org.vaadin.addons.dramafinder.tests.it.MultiSelectComboBoxViewIT]: MultiSelectComboBoxViewIT does not declare any static, non-private, non-final, nested classes annotated with @Configuration.
2026-09-20T12:03:30.827Z INFO 3845258 --- [Pool-1-worker-2] t.c.s.AnnotationConfigContextLoaderUtils : Could not detect default configuration classes for test class [org.vaadin.addons.dramafinder.tests.it.SpringPlaywrightIT]: SpringPlaywrightIT does not declare any static, non-private, non-final, nested classes annotated with @Configuration.
2026-09-20T12:03:30.827Z INFO 3845258 --- [Pool-1-worker-2] t.c.s.AnnotationConfigContextLoaderUtils : Could not detect default configuration classes for test class [org.vaadin.addons.dramafinder.AbstractBasePlaywrightIT]: AbstractBasePlaywrightIT does not declare any static, non-private, non-final, nested classes annotated with @Configuration.
2026-09-20T12:03:30.828Z INFO 3845258 --- [Pool-1-worker-2] .b.t.c.SpringBootTestContextBootstrapper : Found @SpringBootConfiguration org.vaadin.addons.dramafinder.tests.TestServer for test class org.vaadin.addons.dramafinder.tests.it.MultiSelectComboBoxViewIT
[INFO] Tests run: 7, Failures: 0, Errors: 0, Skipped: 0, Time elapsed: 13.46 s -- in org.vaadin.addons.dramafinder.tests.it.GridFooterViewIT
[INFO] Running org.vaadin.addons.dramafinder.tests.it.LoginFormViewIT
2026-09-20T12:03:39.233Z INFO 3845258 --- [Pool-1-worker-3] t.c.s.AnnotationConfigContextLoaderUtils : Could not detect default configuration classes for test class [org.vaadin.addons.dramafinder.tests.it.LoginFormViewIT]: LoginFormViewIT does not declare any static, non-private, non-final, nested classes annotated with @Configuration.
2026-09-20T12:03:39.237Z INFO 3845258 --- [Pool-1-worker-3] .b.t.c.SpringBootTestContextBootstrapper : Found @SpringBootConfiguration org.vaadin.addons.dramafinder.tests.TestServer for test class org.vaadin.addons.dramafinder.tests.it.LoginFormViewIT
2026-09-20T12:03:39.241Z INFO 3845258 --- [Pool-1-worker-3] t.c.s.AnnotationConfigContextLoaderUtils : Could not detect default configuration classes for test class [org.vaadin.addons.dramafinder.tests.it.LoginFormViewIT]: LoginFormViewIT does not declare any static, non-private, non-final, nested classes annotated with @Configuration.
2026-09-20T12:03:39.241Z INFO 3845258 --- [Pool-1-worker-3] t.c.s.AnnotationConfigContextLoaderUtils : Could not detect default configuration classes for test class [org.vaadin.addons.dramafinder.tests.it.SpringPlaywrightIT]: SpringPlaywrightIT does not declare any static, non-private, non-final, nested classes annotated with @Configuration.
2026-09-20T12:03:39.241Z INFO 3845258 --- [Pool-1-worker-3] t.c.s.AnnotationConfigContextLoaderUtils : Could not detect default configuration classes for test class [org.vaadin.addons.dramafinder.AbstractBasePlaywrightIT]: AbstractBasePlaywrightIT does not declare any static, non-private, non-final, nested classes annotated with @Configuration.
2026-09-20T12:03:39.242Z INFO 3845258 --- [Pool-1-worker-3] .b.t.c.SpringBootTestContextBootstrapper : Found @SpringBootConfiguration org.vaadin.addons.dramafinder.tests.TestServer for test class org.vaadin.addons.dramafinder.tests.it.LoginFormViewIT
[INFO] Tests run: 7, Failures: 0, Errors: 0, Skipped: 0, Time elapsed: 13.24 s -- in org.vaadin.addons.dramafinder.tests.it.LoginFormViewIT
[INFO] Running org.vaadin.addons.dramafinder.tests.it.ListBoxViewIT
2026-09-20T12:03:52.483Z INFO 3845258 --- [Pool-1-worker-3] t.c.s.AnnotationConfigContextLoaderUtils : Could not detect default configuration classes for test class [org.vaadin.addons.dramafinder.tests.it.ListBoxViewIT]: ListBoxViewIT does not declare any static, non-private, non-final, nested classes annotated with @Configuration.
2026-09-20T12:03:52.486Z INFO 3845258 --- [Pool-1-worker-3] .b.t.c.SpringBootTestContextBootstrapper : Found @SpringBootConfiguration org.vaadin.addons.dramafinder.tests.TestServer for test class org.vaadin.addons.dramafinder.tests.it.ListBoxViewIT
2026-09-20T12:03:52.489Z INFO 3845258 --- [Pool-1-worker-3] t.c.s.AnnotationConfigContextLoaderUtils : Could not detect default configuration classes for test class [org.vaadin.addons.dramafinder.tests.it.ListBoxViewIT]: ListBoxViewIT does not declare any static, non-private, non-final, nested classes annotated with @Configuration.
2026-09-20T12:03:52.490Z INFO 3845258 --- [Pool-1-worker-3] t.c.s.AnnotationConfigContextLoaderUtils : Could not detect default configuration classes for test class [org.vaadin.addons.dramafinder.tests.it.SpringPlaywrightIT]: SpringPlaywrightIT does not declare any static, non-private, non-final, nested classes annotated with @Configuration.
2026-09-20T12:03:52.490Z INFO 3845258 --- [Pool-1-worker-3] t.c.s.AnnotationConfigContextLoaderUtils : Could not detect default configuration classes for test class [org.vaadin.addons.dramafinder.AbstractBasePlaywrightIT]: AbstractBasePlaywrightIT does not declare any static, non-private, non-final, nested classes annotated with @Configuration.
2026-09-20T12:03:52.491Z INFO 3845258 --- [Pool-1-worker-3] .b.t.c.SpringBootTestContextBootstrapper : Found @SpringBootConfiguration org.vaadin.addons.dramafinder.tests.TestServer for test class org.vaadin.addons.dramafinder.tests.it.ListBoxViewIT
[INFO] Tests run: 16, Failures: 0, Errors: 0, Skipped: 0, Time elapsed: 53.42 s -- in org.vaadin.addons.dramafinder.tests.it.TreeGridExpandCollapseViewIT
[INFO] Running org.vaadin.addons.dramafinder.tests.it.SwitchViewIT
2026-09-20T12:04:08.650Z INFO 3845258 --- [Pool-1-worker-1] t.c.s.AnnotationConfigContextLoaderUtils : Could not detect default configuration classes for test class [org.vaadin.addons.dramafinder.tests.it.SwitchViewIT]: SwitchViewIT does not declare any static, non-private, non-final, nested classes annotated with @Configuration.
2026-09-20T12:04:08.652Z INFO 3845258 --- [Pool-1-worker-1] .b.t.c.SpringBootTestContextBootstrapper : Found @SpringBootConfiguration org.vaadin.addons.dramafinder.tests.TestServer for test class org.vaadin.addons.dramafinder.tests.it.SwitchViewIT
2026-09-20T12:04:08.661Z INFO 3845258 --- [Pool-1-worker-1] t.c.s.AnnotationConfigContextLoaderUtils : Could not detect default configuration classes for test class [org.vaadin.addons.dramafinder.tests.it.SwitchViewIT]: SwitchViewIT does not declare any static, non-private, non-final, nested classes annotated with @Configuration.
2026-09-20T12:04:08.661Z INFO 3845258 --- [Pool-1-worker-1] t.c.s.AnnotationConfigContextLoaderUtils : Could not detect default configuration classes for test class [org.vaadin.addons.dramafinder.tests.it.SpringPlaywrightIT]: SpringPlaywrightIT does not declare any static, non-private, non-final, nested classes annotated with @Configuration.
2026-09-20T12:04:08.661Z INFO 3845258 --- [Pool-1-worker-1] t.c.s.AnnotationConfigContextLoaderUtils : Could not detect default configuration classes for test class [org.vaadin.addons.dramafinder.AbstractBasePlaywrightIT]: AbstractBasePlaywrightIT does not declare any static, non-private, non-final, nested classes annotated with @Configuration.
2026-09-20T12:04:08.672Z INFO 3845258 --- [Pool-1-worker-1] .b.t.c.SpringBootTestContextBootstrapper : Found @SpringBootConfiguration org.vaadin.addons.dramafinder.tests.TestServer for test class org.vaadin.addons.dramafinder.tests.it.SwitchViewIT
[INFO] Tests run: 9, Failures: 0, Errors: 0, Skipped: 0, Time elapsed: 16.48 s -- in org.vaadin.addons.dramafinder.tests.it.ListBoxViewIT
[INFO] Running org.vaadin.addons.dramafinder.tests.it.GridComponentRendererViewIT
2026-09-20T12:04:08.959Z INFO 3845258 --- [Pool-1-worker-3] t.c.s.AnnotationConfigContextLoaderUtils : Could not detect default configuration classes for test class [org.vaadin.addons.dramafinder.tests.it.GridComponentRendererViewIT]: GridComponentRendererViewIT does not declare any static, non-private, non-final, nested classes annotated with @Configuration.
2026-09-20T12:04:08.970Z INFO 3845258 --- [Pool-1-worker-3] .b.t.c.SpringBootTestContextBootstrapper : Found @SpringBootConfiguration org.vaadin.addons.dramafinder.tests.TestServer for test class org.vaadin.addons.dramafinder.tests.it.GridComponentRendererViewIT
2026-09-20T12:04:08.975Z INFO 3845258 --- [Pool-1-worker-3] t.c.s.AnnotationConfigContextLoaderUtils : Could not detect default configuration classes for test class [org.vaadin.addons.dramafinder.tests.it.GridComponentRendererViewIT]: GridComponentRendererViewIT does not declare any static, non-private, non-final, nested classes annotated with @Configuration.
2026-09-20T12:04:08.977Z INFO 3845258 --- [Pool-1-worker-3] t.c.s.AnnotationConfigContextLoaderUtils : Could not detect default configuration classes for test class [org.vaadin.addons.dramafinder.tests.it.SpringPlaywrightIT]: SpringPlaywrightIT does not declare any static, non-private, non-final, nested classes annotated with @Configuration.
2026-09-20T12:04:08.977Z INFO 3845258 --- [Pool-1-worker-3] t.c.s.AnnotationConfigContextLoaderUtils : Could not detect default configuration classes for test class [org.vaadin.addons.dramafinder.AbstractBasePlaywrightIT]: AbstractBasePlaywrightIT does not declare any static, non-private, non-final, nested classes annotated with @Configuration.
2026-09-20T12:04:08.978Z INFO 3845258 --- [Pool-1-worker-3] .b.t.c.SpringBootTestContextBootstrapper : Found @SpringBootConfiguration org.vaadin.addons.dramafinder.tests.TestServer for test class org.vaadin.addons.dramafinder.tests.it.GridComponentRendererViewIT
[INFO] Tests run: 7, Failures: 0, Errors: 0, Skipped: 0, Time elapsed: 16.05 s -- in org.vaadin.addons.dramafinder.tests.it.GridComponentRendererViewIT
[INFO] Running org.vaadin.addons.dramafinder.tests.it.TooltipViewIT
2026-09-20T12:04:25.010Z INFO 3845258 --- [Pool-1-worker-3] t.c.s.AnnotationConfigContextLoaderUtils : Could not detect default configuration classes for test class [org.vaadin.addons.dramafinder.tests.it.TooltipViewIT]: TooltipViewIT does not declare any static, non-private, non-final, nested classes annotated with @Configuration.
2026-09-20T12:04:25.017Z INFO 3845258 --- [Pool-1-worker-3] .b.t.c.SpringBootTestContextBootstrapper : Found @SpringBootConfiguration org.vaadin.addons.dramafinder.tests.TestServer for test class org.vaadin.addons.dramafinder.tests.it.TooltipViewIT
2026-09-20T12:04:25.026Z INFO 3845258 --- [Pool-1-worker-3] t.c.s.AnnotationConfigContextLoaderUtils : Could not detect default configuration classes for test class [org.vaadin.addons.dramafinder.tests.it.TooltipViewIT]: TooltipViewIT does not declare any static, non-private, non-final, nested classes annotated with @Configuration.
2026-09-20T12:04:25.027Z INFO 3845258 --- [Pool-1-worker-3] t.c.s.AnnotationConfigContextLoaderUtils : Could not detect default configuration classes for test class [org.vaadin.addons.dramafinder.tests.it.SpringPlaywrightIT]: SpringPlaywrightIT does not declare any static, non-private, non-final, nested classes annotated with @Configuration.
2026-09-20T12:04:25.027Z INFO 3845258 --- [Pool-1-worker-3] t.c.s.AnnotationConfigContextLoaderUtils : Could not detect default configuration classes for test class [org.vaadin.addons.dramafinder.AbstractBasePlaywrightIT]: AbstractBasePlaywrightIT does not declare any static, non-private, non-final, nested classes annotated with @Configuration.
2026-09-20T12:04:25.028Z INFO 3845258 --- [Pool-1-worker-3] .b.t.c.SpringBootTestContextBootstrapper : Found @SpringBootConfiguration org.vaadin.addons.dramafinder.tests.TestServer for test class org.vaadin.addons.dramafinder.tests.it.TooltipViewIT
[INFO] Tests run: 10, Failures: 0, Errors: 0, Skipped: 0, Time elapsed: 17.54 s -- in org.vaadin.addons.dramafinder.tests.it.SwitchViewIT
[INFO] Running org.vaadin.addons.dramafinder.tests.it.TabSheetViewIT
2026-09-20T12:04:26.192Z INFO 3845258 --- [Pool-1-worker-1] t.c.s.AnnotationConfigContextLoaderUtils : Could not detect default configuration classes for test class [org.vaadin.addons.dramafinder.tests.it.TabSheetViewIT]: TabSheetViewIT does not declare any static, non-private, non-final, nested classes annotated with @Configuration.
2026-09-20T12:04:26.197Z INFO 3845258 --- [Pool-1-worker-1] .b.t.c.SpringBootTestContextBootstrapper : Found @SpringBootConfiguration org.vaadin.addons.dramafinder.tests.TestServer for test class org.vaadin.addons.dramafinder.tests.it.TabSheetViewIT
2026-09-20T12:04:26.198Z INFO 3845258 --- [Pool-1-worker-1] t.c.s.AnnotationConfigContextLoaderUtils : Could not detect default configuration classes for test class [org.vaadin.addons.dramafinder.tests.it.TabSheetViewIT]: TabSheetViewIT does not declare any static, non-private, non-final, nested classes annotated with @Configuration.
2026-09-20T12:04:26.199Z INFO 3845258 --- [Pool-1-worker-1] t.c.s.AnnotationConfigContextLoaderUtils : Could not detect default configuration classes for test class [org.vaadin.addons.dramafinder.tests.it.SpringPlaywrightIT]: SpringPlaywrightIT does not declare any static, non-private, non-final, nested classes annotated with @Configuration.
2026-09-20T12:04:26.199Z INFO 3845258 --- [Pool-1-worker-1] t.c.s.AnnotationConfigContextLoaderUtils : Could not detect default configuration classes for test class [org.vaadin.addons.dramafinder.AbstractBasePlaywrightIT]: AbstractBasePlaywrightIT does not declare any static, non-private, non-final, nested classes annotated with @Configuration.
2026-09-20T12:04:26.207Z INFO 3845258 --- [Pool-1-worker-1] .b.t.c.SpringBootTestContextBootstrapper : Found @SpringBootConfiguration org.vaadin.addons.dramafinder.tests.TestServer for test class org.vaadin.addons.dramafinder.tests.it.TabSheetViewIT
[INFO] Tests run: 1, Failures: 0, Errors: 0, Skipped: 0, Time elapsed: 3.063 s -- in org.vaadin.addons.dramafinder.tests.it.TabSheetViewIT
[INFO] Running org.vaadin.addons.dramafinder.tests.it.IntegerFieldGetByLabelIT
2026-09-20T12:04:29.259Z INFO 3845258 --- [Pool-1-worker-1] t.c.s.AnnotationConfigContextLoaderUtils : Could not detect default configuration classes for test class [org.vaadin.addons.dramafinder.tests.it.IntegerFieldGetByLabelIT]: IntegerFieldGetByLabelIT does not declare any static, non-private, non-final, nested classes annotated with @Configuration.
2026-09-20T12:04:29.260Z INFO 3845258 --- [Pool-1-worker-1] .b.t.c.SpringBootTestContextBootstrapper : Found @SpringBootConfiguration org.vaadin.addons.dramafinder.tests.TestServer for test class org.vaadin.addons.dramafinder.tests.it.IntegerFieldGetByLabelIT
2026-09-20T12:04:29.261Z INFO 3845258 --- [Pool-1-worker-1] t.c.s.AnnotationConfigContextLoaderUtils : Could not detect default configuration classes for test class [org.vaadin.addons.dramafinder.tests.it.IntegerFieldGetByLabelIT]: IntegerFieldGetByLabelIT does not declare any static, non-private, non-final, nested classes annotated with @Configuration.
2026-09-20T12:04:29.264Z INFO 3845258 --- [Pool-1-worker-1] t.c.s.AnnotationConfigContextLoaderUtils : Could not detect default configuration classes for test class [org.vaadin.addons.dramafinder.tests.it.SpringPlaywrightIT]: SpringPlaywrightIT does not declare any static, non-private, non-final, nested classes annotated with @Configuration.
2026-09-20T12:04:29.265Z INFO 3845258 --- [Pool-1-worker-1] t.c.s.AnnotationConfigContextLoaderUtils : Could not detect default configuration classes for test class [org.vaadin.addons.dramafinder.AbstractBasePlaywrightIT]: AbstractBasePlaywrightIT does not declare any static, non-private, non-final, nested classes annotated with @Configuration.
2026-09-20T12:04:29.265Z INFO 3845258 --- [Pool-1-worker-1] .b.t.c.SpringBootTestContextBootstrapper : Found @SpringBootConfiguration org.vaadin.addons.dramafinder.tests.TestServer for test class org.vaadin.addons.dramafinder.tests.it.IntegerFieldGetByLabelIT
[INFO] Tests run: 3, Failures: 0, Errors: 0, Skipped: 0, Time elapsed: 6.891 s -- in org.vaadin.addons.dramafinder.tests.it.IntegerFieldGetByLabelIT
[INFO] Running org.vaadin.addons.dramafinder.tests.it.SplitLayoutViewIT
2026-09-20T12:04:36.153Z INFO 3845258 --- [Pool-1-worker-1] t.c.s.AnnotationConfigContextLoaderUtils : Could not detect default configuration classes for test class [org.vaadin.addons.dramafinder.tests.it.SplitLayoutViewIT]: SplitLayoutViewIT does not declare any static, non-private, non-final, nested classes annotated with @Configuration.
2026-09-20T12:04:36.154Z INFO 3845258 --- [Pool-1-worker-1] .b.t.c.SpringBootTestContextBootstrapper : Found @SpringBootConfiguration org.vaadin.addons.dramafinder.tests.TestServer for test class org.vaadin.addons.dramafinder.tests.it.SplitLayoutViewIT
2026-09-20T12:04:36.156Z INFO 3845258 --- [Pool-1-worker-1] t.c.s.AnnotationConfigContextLoaderUtils : Could not detect default configuration classes for test class [org.vaadin.addons.dramafinder.tests.it.SplitLayoutViewIT]: SplitLayoutViewIT does not declare any static, non-private, non-final, nested classes annotated with @Configuration.
2026-09-20T12:04:36.156Z INFO 3845258 --- [Pool-1-worker-1] t.c.s.AnnotationConfigContextLoaderUtils : Could not detect default configuration classes for test class [org.vaadin.addons.dramafinder.tests.it.SpringPlaywrightIT]: SpringPlaywrightIT does not declare any static, non-private, non-final, nested classes annotated with @Configuration.
2026-09-20T12:04:36.156Z INFO 3845258 --- [Pool-1-worker-1] t.c.s.AnnotationConfigContextLoaderUtils : Could not detect default configuration classes for test class [org.vaadin.addons.dramafinder.AbstractBasePlaywrightIT]: AbstractBasePlaywrightIT does not declare any static, non-private, non-final, nested classes annotated with @Configuration.
2026-09-20T12:04:36.163Z INFO 3845258 --- [Pool-1-worker-1] .b.t.c.SpringBootTestContextBootstrapper : Found @SpringBootConfiguration org.vaadin.addons.dramafinder.tests.TestServer for test class org.vaadin.addons.dramafinder.tests.it.SplitLayoutViewIT
[INFO] Tests run: 4, Failures: 0, Errors: 0, Skipped: 0, Time elapsed: 9.412 s -- in org.vaadin.addons.dramafinder.tests.it.SplitLayoutViewIT
[INFO] Running org.vaadin.addons.dramafinder.tests.it.IntegerFieldViewIT
2026-09-20T12:04:45.565Z INFO 3845258 --- [Pool-1-worker-1] t.c.s.AnnotationConfigContextLoaderUtils : Could not detect default configuration classes for test class [org.vaadin.addons.dramafinder.tests.it.IntegerFieldViewIT]: IntegerFieldViewIT does not declare any static, non-private, non-final, nested classes annotated with @Configuration.
2026-09-20T12:04:45.566Z INFO 3845258 --- [Pool-1-worker-1] .b.t.c.SpringBootTestContextBootstrapper : Found @SpringBootConfiguration org.vaadin.addons.dramafinder.tests.TestServer for test class org.vaadin.addons.dramafinder.tests.it.IntegerFieldViewIT
2026-09-20T12:04:45.571Z INFO 3845258 --- [Pool-1-worker-1] t.c.s.AnnotationConfigContextLoaderUtils : Could not detect default configuration classes for test class [org.vaadin.addons.dramafinder.tests.it.IntegerFieldViewIT]: IntegerFieldViewIT does not declare any static, non-private, non-final, nested classes annotated with @Configuration.
2026-09-20T12:04:45.574Z INFO 3845258 --- [Pool-1-worker-1] t.c.s.AnnotationConfigContextLoaderUtils : Could not detect default configuration classes for test class [org.vaadin.addons.dramafinder.tests.it.SpringPlaywrightIT]: SpringPlaywrightIT does not declare any static, non-private, non-final, nested classes annotated with @Configuration.
2026-09-20T12:04:45.575Z INFO 3845258 --- [Pool-1-worker-1] t.c.s.AnnotationConfigContextLoaderUtils : Could not detect default configuration classes for test class [org.vaadin.addons.dramafinder.AbstractBasePlaywrightIT]: AbstractBasePlaywrightIT does not declare any static, non-private, non-final, nested classes annotated with @Configuration.
2026-09-20T12:04:45.575Z INFO 3845258 --- [Pool-1-worker-1] .b.t.c.SpringBootTestContextBootstrapper : Found @SpringBootConfiguration org.vaadin.addons.dramafinder.tests.TestServer for test class org.vaadin.addons.dramafinder.tests.it.IntegerFieldViewIT
[INFO] Tests run: 32, Failures: 0, Errors: 0, Skipped: 0, Time elapsed: 76.03 s -- in org.vaadin.addons.dramafinder.tests.it.MultiSelectComboBoxViewIT
[INFO] Running org.vaadin.addons.dramafinder.tests.it.ContextMenuViewIT
2026-09-20T12:04:46.861Z INFO 3845258 --- [Pool-1-worker-2] t.c.s.AnnotationConfigContextLoaderUtils : Could not detect default configuration classes for test class [org.vaadin.addons.dramafinder.tests.it.ContextMenuViewIT]: ContextMenuViewIT does not declare any static, non-private, non-final, nested classes annotated with @Configuration.
2026-09-20T12:04:46.872Z INFO 3845258 --- [Pool-1-worker-2] .b.t.c.SpringBootTestContextBootstrapper : Found @SpringBootConfiguration org.vaadin.addons.dramafinder.tests.TestServer for test class org.vaadin.addons.dramafinder.tests.it.ContextMenuViewIT
2026-09-20T12:04:46.878Z INFO 3845258 --- [Pool-1-worker-2] t.c.s.AnnotationConfigContextLoaderUtils : Could not detect default configuration classes for test class [org.vaadin.addons.dramafinder.tests.it.ContextMenuViewIT]: ContextMenuViewIT does not declare any static, non-private, non-final, nested classes annotated with @Configuration.
2026-09-20T12:04:46.878Z INFO 3845258 --- [Pool-1-worker-2] t.c.s.AnnotationConfigContextLoaderUtils : Could not detect default configuration classes for test class [org.vaadin.addons.dramafinder.tests.it.SpringPlaywrightIT]: SpringPlaywrightIT does not declare any static, non-private, non-final, nested classes annotated with @Configuration.
2026-09-20T12:04:46.878Z INFO 3845258 --- [Pool-1-worker-2] t.c.s.AnnotationConfigContextLoaderUtils : Could not detect default configuration classes for test class [org.vaadin.addons.dramafinder.AbstractBasePlaywrightIT]: AbstractBasePlaywrightIT does not declare any static, non-private, non-final, nested classes annotated with @Configuration.
2026-09-20T12:04:46.885Z INFO 3845258 --- [Pool-1-worker-2] .b.t.c.SpringBootTestContextBootstrapper : Found @SpringBootConfiguration org.vaadin.addons.dramafinder.tests.TestServer for test class org.vaadin.addons.dramafinder.tests.it.ContextMenuViewIT
[INFO] Tests run: 4, Failures: 0, Errors: 0, Skipped: 0, Time elapsed: 9.981 s -- in org.vaadin.addons.dramafinder.tests.it.IntegerFieldViewIT
[INFO] Running org.vaadin.addons.dramafinder.tests.it.DetailsViewIT
2026-09-20T12:04:55.555Z INFO 3845258 --- [Pool-1-worker-1] t.c.s.AnnotationConfigContextLoaderUtils : Could not detect default configuration classes for test class [org.vaadin.addons.dramafinder.tests.it.DetailsViewIT]: DetailsViewIT does not declare any static, non-private, non-final, nested classes annotated with @Configuration.
2026-09-20T12:04:55.557Z INFO 3845258 --- [Pool-1-worker-1] .b.t.c.SpringBootTestContextBootstrapper : Found @SpringBootConfiguration org.vaadin.addons.dramafinder.tests.TestServer for test class org.vaadin.addons.dramafinder.tests.it.DetailsViewIT
2026-09-20T12:04:55.558Z INFO 3845258 --- [Pool-1-worker-1] t.c.s.AnnotationConfigContextLoaderUtils : Could not detect default configuration classes for test class [org.vaadin.addons.dramafinder.tests.it.DetailsViewIT]: DetailsViewIT does not declare any static, non-private, non-final, nested classes annotated with @Configuration.
2026-09-20T12:04:55.564Z INFO 3845258 --- [Pool-1-worker-1] t.c.s.AnnotationConfigContextLoaderUtils : Could not detect default configuration classes for test class [org.vaadin.addons.dramafinder.tests.it.SpringPlaywrightIT]: SpringPlaywrightIT does not declare any static, non-private, non-final, nested classes annotated with @Configuration.
2026-09-20T12:04:55.564Z INFO 3845258 --- [Pool-1-worker-1] t.c.s.AnnotationConfigContextLoaderUtils : Could not detect default configuration classes for test class [org.vaadin.addons.dramafinder.AbstractBasePlaywrightIT]: AbstractBasePlaywrightIT does not declare any static, non-private, non-final, nested classes annotated with @Configuration.
2026-09-20T12:04:55.565Z INFO 3845258 --- [Pool-1-worker-1] .b.t.c.SpringBootTestContextBootstrapper : Found @SpringBootConfiguration org.vaadin.addons.dramafinder.tests.TestServer for test class org.vaadin.addons.dramafinder.tests.it.DetailsViewIT
[INFO] Tests run: 6, Failures: 0, Errors: 0, Skipped: 0, Time elapsed: 15.80 s -- in org.vaadin.addons.dramafinder.tests.it.ContextMenuViewIT
[INFO] Running org.vaadin.addons.dramafinder.tests.it.PopoverViewIT
2026-09-20T12:05:02.656Z INFO 3845258 --- [Pool-1-worker-2] t.c.s.AnnotationConfigContextLoaderUtils : Could not detect default configuration classes for test class [org.vaadin.addons.dramafinder.tests.it.PopoverViewIT]: PopoverViewIT does not declare any static, non-private, non-final, nested classes annotated with @Configuration.
2026-09-20T12:05:02.666Z INFO 3845258 --- [Pool-1-worker-2] .b.t.c.SpringBootTestContextBootstrapper : Found @SpringBootConfiguration org.vaadin.addons.dramafinder.tests.TestServer for test class org.vaadin.addons.dramafinder.tests.it.PopoverViewIT
2026-09-20T12:05:02.676Z INFO 3845258 --- [Pool-1-worker-2] t.c.s.AnnotationConfigContextLoaderUtils : Could not detect default configuration classes for test class [org.vaadin.addons.dramafinder.tests.it.PopoverViewIT]: PopoverViewIT does not declare any static, non-private, non-final, nested classes annotated with @Configuration.
2026-09-20T12:05:02.677Z INFO 3845258 --- [Pool-1-worker-2] t.c.s.AnnotationConfigContextLoaderUtils : Could not detect default configuration classes for test class [org.vaadin.addons.dramafinder.tests.it.SpringPlaywrightIT]: SpringPlaywrightIT does not declare any static, non-private, non-final, nested classes annotated with @Configuration.
2026-09-20T12:05:02.679Z INFO 3845258 --- [Pool-1-worker-2] t.c.s.AnnotationConfigContextLoaderUtils : Could not detect default configuration classes for test class [org.vaadin.addons.dramafinder.AbstractBasePlaywrightIT]: AbstractBasePlaywrightIT does not declare any static, non-private, non-final, nested classes annotated with @Configuration.
2026-09-20T12:05:02.683Z INFO 3845258 --- [Pool-1-worker-2] .b.t.c.SpringBootTestContextBootstrapper : Found @SpringBootConfiguration org.vaadin.addons.dramafinder.tests.TestServer for test class org.vaadin.addons.dramafinder.tests.it.PopoverViewIT
[INFO] Tests run: 21, Failures: 0, Errors: 0, Skipped: 0, Time elapsed: 41.95 s -- in org.vaadin.addons.dramafinder.tests.it.TooltipViewIT
[INFO] Running org.vaadin.addons.dramafinder.tests.it.AppLayoutViewIT
2026-09-20T12:05:06.971Z INFO 3845258 --- [Pool-1-worker-3] t.c.s.AnnotationConfigContextLoaderUtils : Could not detect default configuration classes for test class [org.vaadin.addons.dramafinder.tests.it.AppLayoutViewIT]: AppLayoutViewIT does not declare any static, non-private, non-final, nested classes annotated with @Configuration.
2026-09-20T12:05:06.973Z INFO 3845258 --- [Pool-1-worker-3] .b.t.c.SpringBootTestContextBootstrapper : Found @SpringBootConfiguration org.vaadin.addons.dramafinder.tests.TestServer for test class org.vaadin.addons.dramafinder.tests.it.AppLayoutViewIT
2026-09-20T12:05:06.974Z INFO 3845258 --- [Pool-1-worker-3] t.c.s.AnnotationConfigContextLoaderUtils : Could not detect default configuration classes for test class [org.vaadin.addons.dramafinder.tests.it.AppLayoutViewIT]: AppLayoutViewIT does not declare any static, non-private, non-final, nested classes annotated with @Configuration.
2026-09-20T12:05:06.974Z INFO 3845258 --- [Pool-1-worker-3] t.c.s.AnnotationConfigContextLoaderUtils : Could not detect default configuration classes for test class [org.vaadin.addons.dramafinder.tests.it.SpringPlaywrightIT]: SpringPlaywrightIT does not declare any static, non-private, non-final, nested classes annotated with @Configuration.
2026-09-20T12:05:06.974Z INFO 3845258 --- [Pool-1-worker-3] t.c.s.AnnotationConfigContextLoaderUtils : Could not detect default configuration classes for test class [org.vaadin.addons.dramafinder.AbstractBasePlaywrightIT]: AbstractBasePlaywrightIT does not declare any static, non-private, non-final, nested classes annotated with @Configuration.
2026-09-20T12:05:06.975Z INFO 3845258 --- [Pool-1-worker-3] .b.t.c.SpringBootTestContextBootstrapper : Found @SpringBootConfiguration org.vaadin.addons.dramafinder.tests.TestServer for test class org.vaadin.addons.dramafinder.tests.it.AppLayoutViewIT
[INFO] Tests run: 7, Failures: 0, Errors: 0, Skipped: 0, Time elapsed: 13.46 s -- in org.vaadin.addons.dramafinder.tests.it.DetailsViewIT
[INFO] Running org.vaadin.addons.dramafinder.tests.it.BreadcrumbsViewIT
2026-09-20T12:05:09.008Z INFO 3845258 --- [Pool-1-worker-1] t.c.s.AnnotationConfigContextLoaderUtils : Could not detect default configuration classes for test class [org.vaadin.addons.dramafinder.tests.it.BreadcrumbsViewIT]: BreadcrumbsViewIT does not declare any static, non-private, non-final, nested classes annotated with @Configuration.
2026-09-20T12:05:09.009Z INFO 3845258 --- [Pool-1-worker-1] .b.t.c.SpringBootTestContextBootstrapper : Found @SpringBootConfiguration org.vaadin.addons.dramafinder.tests.TestServer for test class org.vaadin.addons.dramafinder.tests.it.BreadcrumbsViewIT
2026-09-20T12:05:09.012Z INFO 3845258 --- [Pool-1-worker-1] t.c.s.AnnotationConfigContextLoaderUtils : Could not detect default configuration classes for test class [org.vaadin.addons.dramafinder.tests.it.BreadcrumbsViewIT]: BreadcrumbsViewIT does not declare any static, non-private, non-final, nested classes annotated with @Configuration.
2026-09-20T12:05:09.012Z INFO 3845258 --- [Pool-1-worker-1] t.c.s.AnnotationConfigContextLoaderUtils : Could not detect default configuration classes for test class [org.vaadin.addons.dramafinder.tests.it.SpringPlaywrightIT]: SpringPlaywrightIT does not declare any static, non-private, non-final, nested classes annotated with @Configuration.
2026-09-20T12:05:09.012Z INFO 3845258 --- [Pool-1-worker-1] t.c.s.AnnotationConfigContextLoaderUtils : Could not detect default configuration classes for test class [org.vaadin.addons.dramafinder.AbstractBasePlaywrightIT]: AbstractBasePlaywrightIT does not declare any static, non-private, non-final, nested classes annotated with @Configuration.
2026-09-20T12:05:09.013Z INFO 3845258 --- [Pool-1-worker-1] .b.t.c.SpringBootTestContextBootstrapper : Found @SpringBootConfiguration org.vaadin.addons.dramafinder.tests.TestServer for test class org.vaadin.addons.dramafinder.tests.it.BreadcrumbsViewIT
[INFO] Tests run: 5, Failures: 0, Errors: 0, Skipped: 0, Time elapsed: 10.12 s -- in org.vaadin.addons.dramafinder.tests.it.PopoverViewIT
[INFO] Running org.vaadin.addons.dramafinder.tests.it.MenuBarViewIT
2026-09-20T12:05:12.779Z INFO 3845258 --- [Pool-1-worker-2] t.c.s.AnnotationConfigContextLoaderUtils : Could not detect default configuration classes for test class [org.vaadin.addons.dramafinder.tests.it.MenuBarViewIT]: MenuBarViewIT does not declare any static, non-private, non-final, nested classes annotated with @Configuration.
2026-09-20T12:05:12.788Z INFO 3845258 --- [Pool-1-worker-2] .b.t.c.SpringBootTestContextBootstrapper : Found @SpringBootConfiguration org.vaadin.addons.dramafinder.tests.TestServer for test class org.vaadin.addons.dramafinder.tests.it.MenuBarViewIT
2026-09-20T12:05:12.789Z INFO 3845258 --- [Pool-1-worker-2] t.c.s.AnnotationConfigContextLoaderUtils : Could not detect default configuration classes for test class [org.vaadin.addons.dramafinder.tests.it.MenuBarViewIT]: MenuBarViewIT does not declare any static, non-private, non-final, nested classes annotated with @Configuration.
2026-09-20T12:05:12.790Z INFO 3845258 --- [Pool-1-worker-2] t.c.s.AnnotationConfigContextLoaderUtils : Could not detect default configuration classes for test class [org.vaadin.addons.dramafinder.tests.it.SpringPlaywrightIT]: SpringPlaywrightIT does not declare any static, non-private, non-final, nested classes annotated with @Configuration.
2026-09-20T12:05:12.790Z INFO 3845258 --- [Pool-1-worker-2] t.c.s.AnnotationConfigContextLoaderUtils : Could not detect default configuration classes for test class [org.vaadin.addons.dramafinder.AbstractBasePlaywrightIT]: AbstractBasePlaywrightIT does not declare any static, non-private, non-final, nested classes annotated with @Configuration.
2026-09-20T12:05:12.796Z INFO 3845258 --- [Pool-1-worker-2] .b.t.c.SpringBootTestContextBootstrapper : Found @SpringBootConfiguration org.vaadin.addons.dramafinder.tests.TestServer for test class org.vaadin.addons.dramafinder.tests.it.MenuBarViewIT
2026-09-20T12:05:16.354Z WARN 3845258 --- [-auto-1-exec-13] com.vaadin.flow.dom.impl.ThemeListImpl : Theme name 'badge success' contains spaces and was added as the separate theme names [badge, success]. Add one theme name per add() call, use HasTheme.addThemeNames(String...), or use Element.setAttribute("theme", ...) to set a space separated value. Only add() splits such a value, so contains(), remove() and the other operations will not match it, and support for it may be removed in a future version.
[INFO] Tests run: 4, Failures: 0, Errors: 0, Skipped: 0, Time elapsed: 8.262 s -- in org.vaadin.addons.dramafinder.tests.it.MenuBarViewIT
[INFO] Running org.vaadin.addons.dramafinder.tests.it.MultiSelectComboBoxGetByLabelIT
2026-09-20T12:05:21.046Z INFO 3845258 --- [Pool-1-worker-2] t.c.s.AnnotationConfigContextLoaderUtils : Could not detect default configuration classes for test class [org.vaadin.addons.dramafinder.tests.it.MultiSelectComboBoxGetByLabelIT]: MultiSelectComboBoxGetByLabelIT does not declare any static, non-private, non-final, nested classes annotated with @Configuration.
2026-09-20T12:05:21.053Z INFO 3845258 --- [Pool-1-worker-2] .b.t.c.SpringBootTestContextBootstrapper : Found @SpringBootConfiguration org.vaadin.addons.dramafinder.tests.TestServer for test class org.vaadin.addons.dramafinder.tests.it.MultiSelectComboBoxGetByLabelIT
2026-09-20T12:05:21.055Z INFO 3845258 --- [Pool-1-worker-2] t.c.s.AnnotationConfigContextLoaderUtils : Could not detect default configuration classes for test class [org.vaadin.addons.dramafinder.tests.it.MultiSelectComboBoxGetByLabelIT]: MultiSelectComboBoxGetByLabelIT does not declare any static, non-private, non-final, nested classes annotated with @Configuration.
2026-09-20T12:05:21.055Z INFO 3845258 --- [Pool-1-worker-2] t.c.s.AnnotationConfigContextLoaderUtils : Could not detect default configuration classes for test class [org.vaadin.addons.dramafinder.tests.it.SpringPlaywrightIT]: SpringPlaywrightIT does not declare any static, non-private, non-final, nested classes annotated with @Configuration.
2026-09-20T12:05:21.056Z INFO 3845258 --- [Pool-1-worker-2] t.c.s.AnnotationConfigContextLoaderUtils : Could not detect default configuration classes for test class [org.vaadin.addons.dramafinder.AbstractBasePlaywrightIT]: AbstractBasePlaywrightIT does not declare any static, non-private, non-final, nested classes annotated with @Configuration.
2026-09-20T12:05:21.060Z INFO 3845258 --- [Pool-1-worker-2] .b.t.c.SpringBootTestContextBootstrapper : Found @SpringBootConfiguration org.vaadin.addons.dramafinder.tests.TestServer for test class org.vaadin.addons.dramafinder.tests.it.MultiSelectComboBoxGetByLabelIT
[INFO] Tests run: 3, Failures: 0, Errors: 0, Skipped: 0, Time elapsed: 5.418 s -- in org.vaadin.addons.dramafinder.tests.it.MultiSelectComboBoxGetByLabelIT
[INFO] Running org.vaadin.addons.dramafinder.tests.it.MessageListViewIT
2026-09-20T12:05:26.469Z INFO 3845258 --- [Pool-1-worker-2] t.c.s.AnnotationConfigContextLoaderUtils : Could not detect default configuration classes for test class [org.vaadin.addons.dramafinder.tests.it.MessageListViewIT]: MessageListViewIT does not declare any static, non-private, non-final, nested classes annotated with @Configuration.
2026-09-20T12:05:26.472Z INFO 3845258 --- [Pool-1-worker-2] .b.t.c.SpringBootTestContextBootstrapper : Found @SpringBootConfiguration org.vaadin.addons.dramafinder.tests.TestServer for test class org.vaadin.addons.dramafinder.tests.it.MessageListViewIT
2026-09-20T12:05:26.472Z INFO 3845258 --- [Pool-1-worker-2] t.c.s.AnnotationConfigContextLoaderUtils : Could not detect default configuration classes for test class [org.vaadin.addons.dramafinder.tests.it.MessageListViewIT]: MessageListViewIT does not declare any static, non-private, non-final, nested classes annotated with @Configuration.
2026-09-20T12:05:26.473Z INFO 3845258 --- [Pool-1-worker-2] t.c.s.AnnotationConfigContextLoaderUtils : Could not detect default configuration classes for test class [org.vaadin.addons.dramafinder.tests.it.SpringPlaywrightIT]: SpringPlaywrightIT does not declare any static, non-private, non-final, nested classes annotated with @Configuration.
2026-09-20T12:05:26.477Z INFO 3845258 --- [Pool-1-worker-2] t.c.s.AnnotationConfigContextLoaderUtils : Could not detect default configuration classes for test class [org.vaadin.addons.dramafinder.AbstractBasePlaywrightIT]: AbstractBasePlaywrightIT does not declare any static, non-private, non-final, nested classes annotated with @Configuration.
2026-09-20T12:05:26.479Z INFO 3845258 --- [Pool-1-worker-2] .b.t.c.SpringBootTestContextBootstrapper : Found @SpringBootConfiguration org.vaadin.addons.dramafinder.tests.TestServer for test class org.vaadin.addons.dramafinder.tests.it.MessageListViewIT
[INFO] Tests run: 12, Failures: 0, Errors: 0, Skipped: 0, Time elapsed: 21.88 s -- in org.vaadin.addons.dramafinder.tests.it.BreadcrumbsViewIT
[INFO] Running org.vaadin.addons.dramafinder.tests.it.EmailFieldViewIT
2026-09-20T12:05:30.889Z INFO 3845258 --- [Pool-1-worker-1] t.c.s.AnnotationConfigContextLoaderUtils : Could not detect default configuration classes for test class [org.vaadin.addons.dramafinder.tests.it.EmailFieldViewIT]: EmailFieldViewIT does not declare any static, non-private, non-final, nested classes annotated with @Configuration.
2026-09-20T12:05:30.894Z INFO 3845258 --- [Pool-1-worker-1] .b.t.c.SpringBootTestContextBootstrapper : Found @SpringBootConfiguration org.vaadin.addons.dramafinder.tests.TestServer for test class org.vaadin.addons.dramafinder.tests.it.EmailFieldViewIT
2026-09-20T12:05:30.897Z INFO 3845258 --- [Pool-1-worker-1] t.c.s.AnnotationConfigContextLoaderUtils : Could not detect default configuration classes for test class [org.vaadin.addons.dramafinder.tests.it.EmailFieldViewIT]: EmailFieldViewIT does not declare any static, non-private, non-final, nested classes annotated with @Configuration.
2026-09-20T12:05:30.898Z INFO 3845258 --- [Pool-1-worker-1] t.c.s.AnnotationConfigContextLoaderUtils : Could not detect default configuration classes for test class [org.vaadin.addons.dramafinder.tests.it.SpringPlaywrightIT]: SpringPlaywrightIT does not declare any static, non-private, non-final, nested classes annotated with @Configuration.
2026-09-20T12:05:30.898Z INFO 3845258 --- [Pool-1-worker-1] t.c.s.AnnotationConfigContextLoaderUtils : Could not detect default configuration classes for test class [org.vaadin.addons.dramafinder.AbstractBasePlaywrightIT]: AbstractBasePlaywrightIT does not declare any static, non-private, non-final, nested classes annotated with @Configuration.
2026-09-20T12:05:30.899Z INFO 3845258 --- [Pool-1-worker-1] .b.t.c.SpringBootTestContextBootstrapper : Found @SpringBootConfiguration org.vaadin.addons.dramafinder.tests.TestServer for test class org.vaadin.addons.dramafinder.tests.it.EmailFieldViewIT
[INFO] Tests run: 4, Failures: 0, Errors: 0, Skipped: 0, Time elapsed: 7.552 s -- in org.vaadin.addons.dramafinder.tests.it.MessageListViewIT
[INFO] Running org.vaadin.addons.dramafinder.tests.it.GridSelectionViewIT
2026-09-20T12:05:34.024Z INFO 3845258 --- [Pool-1-worker-2] t.c.s.AnnotationConfigContextLoaderUtils : Could not detect default configuration classes for test class [org.vaadin.addons.dramafinder.tests.it.GridSelectionViewIT]: GridSelectionViewIT does not declare any static, non-private, non-final, nested classes annotated with @Configuration.
2026-09-20T12:05:34.026Z INFO 3845258 --- [Pool-1-worker-2] .b.t.c.SpringBootTestContextBootstrapper : Found @SpringBootConfiguration org.vaadin.addons.dramafinder.tests.TestServer for test class org.vaadin.addons.dramafinder.tests.it.GridSelectionViewIT
2026-09-20T12:05:34.028Z INFO 3845258 --- [Pool-1-worker-2] t.c.s.AnnotationConfigContextLoaderUtils : Could not detect default configuration classes for test class [org.vaadin.addons.dramafinder.tests.it.GridSelectionViewIT]: GridSelectionViewIT does not declare any static, non-private, non-final, nested classes annotated with @Configuration.
2026-09-20T12:05:34.030Z INFO 3845258 --- [Pool-1-worker-2] t.c.s.AnnotationConfigContextLoaderUtils : Could not detect default configuration classes for test class [org.vaadin.addons.dramafinder.tests.it.SpringPlaywrightIT]: SpringPlaywrightIT does not declare any static, non-private, non-final, nested classes annotated with @Configuration.
2026-09-20T12:05:34.030Z INFO 3845258 --- [Pool-1-worker-2] t.c.s.AnnotationConfigContextLoaderUtils : Could not detect default configuration classes for test class [org.vaadin.addons.dramafinder.AbstractBasePlaywrightIT]: AbstractBasePlaywrightIT does not declare any static, non-private, non-final, nested classes annotated with @Configuration.
2026-09-20T12:05:34.030Z INFO 3845258 --- [Pool-1-worker-2] .b.t.c.SpringBootTestContextBootstrapper : Found @SpringBootConfiguration org.vaadin.addons.dramafinder.tests.TestServer for test class org.vaadin.addons.dramafinder.tests.it.GridSelectionViewIT
[INFO] Tests run: 3, Failures: 0, Errors: 0, Skipped: 0, Time elapsed: 6.550 s -- in org.vaadin.addons.dramafinder.tests.it.EmailFieldViewIT
[INFO] Running org.vaadin.addons.dramafinder.tests.it.NumberFieldGetByLabelIT
2026-09-20T12:05:37.434Z INFO 3845258 --- [Pool-1-worker-1] t.c.s.AnnotationConfigContextLoaderUtils : Could not detect default configuration classes for test class [org.vaadin.addons.dramafinder.tests.it.NumberFieldGetByLabelIT]: NumberFieldGetByLabelIT does not declare any static, non-private, non-final, nested classes annotated with @Configuration.
2026-09-20T12:05:37.445Z INFO 3845258 --- [Pool-1-worker-1] .b.t.c.SpringBootTestContextBootstrapper : Found @SpringBootConfiguration org.vaadin.addons.dramafinder.tests.TestServer for test class org.vaadin.addons.dramafinder.tests.it.NumberFieldGetByLabelIT
2026-09-20T12:05:37.446Z INFO 3845258 --- [Pool-1-worker-1] t.c.s.AnnotationConfigContextLoaderUtils : Could not detect default configuration classes for test class [org.vaadin.addons.dramafinder.tests.it.NumberFieldGetByLabelIT]: NumberFieldGetByLabelIT does not declare any static, non-private, non-final, nested classes annotated with @Configuration.
2026-09-20T12:05:37.447Z INFO 3845258 --- [Pool-1-worker-1] t.c.s.AnnotationConfigContextLoaderUtils : Could not detect default configuration classes for test class [org.vaadin.addons.dramafinder.tests.it.SpringPlaywrightIT]: SpringPlaywrightIT does not declare any static, non-private, non-final, nested classes annotated with @Configuration.
2026-09-20T12:05:37.447Z INFO 3845258 --- [Pool-1-worker-1] t.c.s.AnnotationConfigContextLoaderUtils : Could not detect default configuration classes for test class [org.vaadin.addons.dramafinder.AbstractBasePlaywrightIT]: AbstractBasePlaywrightIT does not declare any static, non-private, non-final, nested classes annotated with @Configuration.
2026-09-20T12:05:37.455Z INFO 3845258 --- [Pool-1-worker-1] .b.t.c.SpringBootTestContextBootstrapper : Found @SpringBootConfiguration org.vaadin.addons.dramafinder.tests.TestServer for test class org.vaadin.addons.dramafinder.tests.it.NumberFieldGetByLabelIT
[INFO] Tests run: 3, Failures: 0, Errors: 0, Skipped: 0, Time elapsed: 6.291 s -- in org.vaadin.addons.dramafinder.tests.it.NumberFieldGetByLabelIT
[INFO] Running org.vaadin.addons.dramafinder.tests.it.DatePickerViewIT
2026-09-20T12:05:43.731Z INFO 3845258 --- [Pool-1-worker-1] t.c.s.AnnotationConfigContextLoaderUtils : Could not detect default configuration classes for test class [org.vaadin.addons.dramafinder.tests.it.DatePickerViewIT]: DatePickerViewIT does not declare any static, non-private, non-final, nested classes annotated with @Configuration.
2026-09-20T12:05:43.737Z INFO 3845258 --- [Pool-1-worker-1] .b.t.c.SpringBootTestContextBootstrapper : Found @SpringBootConfiguration org.vaadin.addons.dramafinder.tests.TestServer for test class org.vaadin.addons.dramafinder.tests.it.DatePickerViewIT
2026-09-20T12:05:43.738Z INFO 3845258 --- [Pool-1-worker-1] t.c.s.AnnotationConfigContextLoaderUtils : Could not detect default configuration classes for test class [org.vaadin.addons.dramafinder.tests.it.DatePickerViewIT]: DatePickerViewIT does not declare any static, non-private, non-final, nested classes annotated with @Configuration.
2026-09-20T12:05:43.738Z INFO 3845258 --- [Pool-1-worker-1] t.c.s.AnnotationConfigContextLoaderUtils : Could not detect default configuration classes for test class [org.vaadin.addons.dramafinder.tests.it.SpringPlaywrightIT]: SpringPlaywrightIT does not declare any static, non-private, non-final, nested classes annotated with @Configuration.
2026-09-20T12:05:43.739Z INFO 3845258 --- [Pool-1-worker-1] t.c.s.AnnotationConfigContextLoaderUtils : Could not detect default configuration classes for test class [org.vaadin.addons.dramafinder.AbstractBasePlaywrightIT]: AbstractBasePlaywrightIT does not declare any static, non-private, non-final, nested classes annotated with @Configuration.
2026-09-20T12:05:43.739Z INFO 3845258 --- [Pool-1-worker-1] .b.t.c.SpringBootTestContextBootstrapper : Found @SpringBootConfiguration org.vaadin.addons.dramafinder.tests.TestServer for test class org.vaadin.addons.dramafinder.tests.it.DatePickerViewIT
[INFO] Tests run: 22, Failures: 0, Errors: 0, Skipped: 0, Time elapsed: 39.91 s -- in org.vaadin.addons.dramafinder.tests.it.AppLayoutViewIT
[INFO] Running org.vaadin.addons.dramafinder.tests.it.PasswordFieldViewIT
2026-09-20T12:05:46.882Z INFO 3845258 --- [Pool-1-worker-3] t.c.s.AnnotationConfigContextLoaderUtils : Could not detect default configuration classes for test class [org.vaadin.addons.dramafinder.tests.it.PasswordFieldViewIT]: PasswordFieldViewIT does not declare any static, non-private, non-final, nested classes annotated with @Configuration.
2026-09-20T12:05:46.884Z INFO 3845258 --- [Pool-1-worker-3] .b.t.c.SpringBootTestContextBootstrapper : Found @SpringBootConfiguration org.vaadin.addons.dramafinder.tests.TestServer for test class org.vaadin.addons.dramafinder.tests.it.PasswordFieldViewIT
2026-09-20T12:05:46.885Z INFO 3845258 --- [Pool-1-worker-3] t.c.s.AnnotationConfigContextLoaderUtils : Could not detect default configuration classes for test class [org.vaadin.addons.dramafinder.tests.it.PasswordFieldViewIT]: PasswordFieldViewIT does not declare any static, non-private, non-final, nested classes annotated with @Configuration.
2026-09-20T12:05:46.885Z INFO 3845258 --- [Pool-1-worker-3] t.c.s.AnnotationConfigContextLoaderUtils : Could not detect default configuration classes for test class [org.vaadin.addons.dramafinder.tests.it.SpringPlaywrightIT]: SpringPlaywrightIT does not declare any static, non-private, non-final, nested classes annotated with @Configuration.
2026-09-20T12:05:46.885Z INFO 3845258 --- [Pool-1-worker-3] t.c.s.AnnotationConfigContextLoaderUtils : Could not detect default configuration classes for test class [org.vaadin.addons.dramafinder.AbstractBasePlaywrightIT]: AbstractBasePlaywrightIT does not declare any static, non-private, non-final, nested classes annotated with @Configuration.
2026-09-20T12:05:46.891Z INFO 3845258 --- [Pool-1-worker-3] .b.t.c.SpringBootTestContextBootstrapper : Found @SpringBootConfiguration org.vaadin.addons.dramafinder.tests.TestServer for test class org.vaadin.addons.dramafinder.tests.it.PasswordFieldViewIT
[INFO] Tests run: 8, Failures: 0, Errors: 0, Skipped: 0, Time elapsed: 23.35 s -- in org.vaadin.addons.dramafinder.tests.it.GridSelectionViewIT
[INFO] Running org.vaadin.addons.dramafinder.tests.it.TextAreaGetByLabelIT
2026-09-20T12:05:57.377Z INFO 3845258 --- [Pool-1-worker-2] t.c.s.AnnotationConfigContextLoaderUtils : Could not detect default configuration classes for test class [org.vaadin.addons.dramafinder.tests.it.TextAreaGetByLabelIT]: TextAreaGetByLabelIT does not declare any static, non-private, non-final, nested classes annotated with @Configuration.
2026-09-20T12:05:57.382Z INFO 3845258 --- [Pool-1-worker-2] .b.t.c.SpringBootTestContextBootstrapper : Found @SpringBootConfiguration org.vaadin.addons.dramafinder.tests.TestServer for test class org.vaadin.addons.dramafinder.tests.it.TextAreaGetByLabelIT
2026-09-20T12:05:57.385Z INFO 3845258 --- [Pool-1-worker-2] t.c.s.AnnotationConfigContextLoaderUtils : Could not detect default configuration classes for test class [org.vaadin.addons.dramafinder.tests.it.TextAreaGetByLabelIT]: TextAreaGetByLabelIT does not declare any static, non-private, non-final, nested classes annotated with @Configuration.
2026-09-20T12:05:57.386Z INFO 3845258 --- [Pool-1-worker-2] t.c.s.AnnotationConfigContextLoaderUtils : Could not detect default configuration classes for test class [org.vaadin.addons.dramafinder.tests.it.SpringPlaywrightIT]: SpringPlaywrightIT does not declare any static, non-private, non-final, nested classes annotated with @Configuration.
2026-09-20T12:05:57.386Z INFO 3845258 --- [Pool-1-worker-2] t.c.s.AnnotationConfigContextLoaderUtils : Could not detect default configuration classes for test class [org.vaadin.addons.dramafinder.AbstractBasePlaywrightIT]: AbstractBasePlaywrightIT does not declare any static, non-private, non-final, nested classes annotated with @Configuration.
2026-09-20T12:05:57.387Z INFO 3845258 --- [Pool-1-worker-2] .b.t.c.SpringBootTestContextBootstrapper : Found @SpringBootConfiguration org.vaadin.addons.dramafinder.tests.TestServer for test class org.vaadin.addons.dramafinder.tests.it.TextAreaGetByLabelIT
[INFO] Tests run: 8, Failures: 0, Errors: 0, Skipped: 0, Time elapsed: 15.52 s -- in org.vaadin.addons.dramafinder.tests.it.DatePickerViewIT
[INFO] Running org.vaadin.addons.dramafinder.tests.it.ComboBoxViewIT
2026-09-20T12:05:59.244Z INFO 3845258 --- [Pool-1-worker-1] t.c.s.AnnotationConfigContextLoaderUtils : Could not detect default configuration classes for test class [org.vaadin.addons.dramafinder.tests.it.ComboBoxViewIT]: ComboBoxViewIT does not declare any static, non-private, non-final, nested classes annotated with @Configuration.
2026-09-20T12:05:59.248Z INFO 3845258 --- [Pool-1-worker-1] .b.t.c.SpringBootTestContextBootstrapper : Found @SpringBootConfiguration org.vaadin.addons.dramafinder.tests.TestServer for test class org.vaadin.addons.dramafinder.tests.it.ComboBoxViewIT
2026-09-20T12:05:59.249Z INFO 3845258 --- [Pool-1-worker-1] t.c.s.AnnotationConfigContextLoaderUtils : Could not detect default configuration classes for test class [org.vaadin.addons.dramafinder.tests.it.ComboBoxViewIT]: ComboBoxViewIT does not declare any static, non-private, non-final, nested classes annotated with @Configuration.
2026-09-20T12:05:59.249Z INFO 3845258 --- [Pool-1-worker-1] t.c.s.AnnotationConfigContextLoaderUtils : Could not detect default configuration classes for test class [org.vaadin.addons.dramafinder.tests.it.SpringPlaywrightIT]: SpringPlaywrightIT does not declare any static, non-private, non-final, nested classes annotated with @Configuration.
2026-09-20T12:05:59.250Z INFO 3845258 --- [Pool-1-worker-1] t.c.s.AnnotationConfigContextLoaderUtils : Could not detect default configuration classes for test class [org.vaadin.addons.dramafinder.AbstractBasePlaywrightIT]: AbstractBasePlaywrightIT does not declare any static, non-private, non-final, nested classes annotated with @Configuration.
2026-09-20T12:05:59.261Z INFO 3845258 --- [Pool-1-worker-1] .b.t.c.SpringBootTestContextBootstrapper : Found @SpringBootConfiguration org.vaadin.addons.dramafinder.tests.TestServer for test class org.vaadin.addons.dramafinder.tests.it.ComboBoxViewIT
[INFO] Tests run: 2, Failures: 0, Errors: 0, Skipped: 0, Time elapsed: 4.063 s -- in org.vaadin.addons.dramafinder.tests.it.TextAreaGetByLabelIT
[INFO] Running org.vaadin.addons.dramafinder.tests.it.SelectViewIT
2026-09-20T12:06:01.442Z INFO 3845258 --- [Pool-1-worker-2] t.c.s.AnnotationConfigContextLoaderUtils : Could not detect default configuration classes for test class [org.vaadin.addons.dramafinder.tests.it.SelectViewIT]: SelectViewIT does not declare any static, non-private, non-final, nested classes annotated with @Configuration.
2026-09-20T12:06:01.443Z INFO 3845258 --- [Pool-1-worker-2] .b.t.c.SpringBootTestContextBootstrapper : Found @SpringBootConfiguration org.vaadin.addons.dramafinder.tests.TestServer for test class org.vaadin.addons.dramafinder.tests.it.SelectViewIT
2026-09-20T12:06:01.446Z INFO 3845258 --- [Pool-1-worker-2] t.c.s.AnnotationConfigContextLoaderUtils : Could not detect default configuration classes for test class [org.vaadin.addons.dramafinder.tests.it.SelectViewIT]: SelectViewIT does not declare any static, non-private, non-final, nested classes annotated with @Configuration.
2026-09-20T12:06:01.446Z INFO 3845258 --- [Pool-1-worker-2] t.c.s.AnnotationConfigContextLoaderUtils : Could not detect default configuration classes for test class [org.vaadin.addons.dramafinder.tests.it.SpringPlaywrightIT]: SpringPlaywrightIT does not declare any static, non-private, non-final, nested classes annotated with @Configuration.
2026-09-20T12:06:01.447Z INFO 3845258 --- [Pool-1-worker-2] t.c.s.AnnotationConfigContextLoaderUtils : Could not detect default configuration classes for test class [org.vaadin.addons.dramafinder.AbstractBasePlaywrightIT]: AbstractBasePlaywrightIT does not declare any static, non-private, non-final, nested classes annotated with @Configuration.
2026-09-20T12:06:01.447Z INFO 3845258 --- [Pool-1-worker-2] .b.t.c.SpringBootTestContextBootstrapper : Found @SpringBootConfiguration org.vaadin.addons.dramafinder.tests.TestServer for test class org.vaadin.addons.dramafinder.tests.it.SelectViewIT
[INFO] Tests run: 23, Failures: 0, Errors: 0, Skipped: 0, Time elapsed: 40.76 s -- in org.vaadin.addons.dramafinder.tests.it.PasswordFieldViewIT
[INFO] Running org.vaadin.addons.dramafinder.tests.it.BigDecimalFieldViewIT
2026-09-20T12:06:27.642Z INFO 3845258 --- [Pool-1-worker-3] t.c.s.AnnotationConfigContextLoaderUtils : Could not detect default configuration classes for test class [org.vaadin.addons.dramafinder.tests.it.BigDecimalFieldViewIT]: BigDecimalFieldViewIT does not declare any static, non-private, non-final, nested classes annotated with @Configuration.
2026-09-20T12:06:27.644Z INFO 3845258 --- [Pool-1-worker-3] .b.t.c.SpringBootTestContextBootstrapper : Found @SpringBootConfiguration org.vaadin.addons.dramafinder.tests.TestServer for test class org.vaadin.addons.dramafinder.tests.it.BigDecimalFieldViewIT
2026-09-20T12:06:27.646Z INFO 3845258 --- [Pool-1-worker-3] t.c.s.AnnotationConfigContextLoaderUtils : Could not detect default configuration classes for test class [org.vaadin.addons.dramafinder.tests.it.BigDecimalFieldViewIT]: BigDecimalFieldViewIT does not declare any static, non-private, non-final, nested classes annotated with @Configuration.
2026-09-20T12:06:27.646Z INFO 3845258 --- [Pool-1-worker-3] t.c.s.AnnotationConfigContextLoaderUtils : Could not detect default configuration classes for test class [org.vaadin.addons.dramafinder.tests.it.SpringPlaywrightIT]: SpringPlaywrightIT does not declare any static, non-private, non-final, nested classes annotated with @Configuration.
2026-09-20T12:06:27.646Z INFO 3845258 --- [Pool-1-worker-3] t.c.s.AnnotationConfigContextLoaderUtils : Could not detect default configuration classes for test class [org.vaadin.addons.dramafinder.AbstractBasePlaywrightIT]: AbstractBasePlaywrightIT does not declare any static, non-private, non-final, nested classes annotated with @Configuration.
2026-09-20T12:06:27.648Z INFO 3845258 --- [Pool-1-worker-3] .b.t.c.SpringBootTestContextBootstrapper : Found @SpringBootConfiguration org.vaadin.addons.dramafinder.tests.TestServer for test class org.vaadin.addons.dramafinder.tests.it.BigDecimalFieldViewIT
[INFO] Tests run: 16, Failures: 0, Errors: 0, Skipped: 0, Time elapsed: 28.87 s -- in org.vaadin.addons.dramafinder.tests.it.SelectViewIT
[INFO] Running org.vaadin.addons.dramafinder.tests.it.TreeGridMultiSelectViewIT
2026-09-20T12:06:30.312Z INFO 3845258 --- [Pool-1-worker-2] t.c.s.AnnotationConfigContextLoaderUtils : Could not detect default configuration classes for test class [org.vaadin.addons.dramafinder.tests.it.TreeGridMultiSelectViewIT]: TreeGridMultiSelectViewIT does not declare any static, non-private, non-final, nested classes annotated with @Configuration.
2026-09-20T12:06:30.314Z INFO 3845258 --- [Pool-1-worker-2] .b.t.c.SpringBootTestContextBootstrapper : Found @SpringBootConfiguration org.vaadin.addons.dramafinder.tests.TestServer for test class org.vaadin.addons.dramafinder.tests.it.TreeGridMultiSelectViewIT
2026-09-20T12:06:30.316Z INFO 3845258 --- [Pool-1-worker-2] t.c.s.AnnotationConfigContextLoaderUtils : Could not detect default configuration classes for test class [org.vaadin.addons.dramafinder.tests.it.TreeGridMultiSelectViewIT]: TreeGridMultiSelectViewIT does not declare any static, non-private, non-final, nested classes annotated with @Configuration.
2026-09-20T12:06:30.316Z INFO 3845258 --- [Pool-1-worker-2] t.c.s.AnnotationConfigContextLoaderUtils : Could not detect default configuration classes for test class [org.vaadin.addons.dramafinder.tests.it.SpringPlaywrightIT]: SpringPlaywrightIT does not declare any static, non-private, non-final, nested classes annotated with @Configuration.
2026-09-20T12:06:30.316Z INFO 3845258 --- [Pool-1-worker-2] t.c.s.AnnotationConfigContextLoaderUtils : Could not detect default configuration classes for test class [org.vaadin.addons.dramafinder.AbstractBasePlaywrightIT]: AbstractBasePlaywrightIT does not declare any static, non-private, non-final, nested classes annotated with @Configuration.
2026-09-20T12:06:30.317Z INFO 3845258 --- [Pool-1-worker-2] .b.t.c.SpringBootTestContextBootstrapper : Found @SpringBootConfiguration org.vaadin.addons.dramafinder.tests.TestServer for test class org.vaadin.addons.dramafinder.tests.it.TreeGridMultiSelectViewIT
[INFO] Tests run: 2, Failures: 0, Errors: 0, Skipped: 0, Time elapsed: 3.791 s -- in org.vaadin.addons.dramafinder.tests.it.BigDecimalFieldViewIT
[INFO] Running org.vaadin.addons.dramafinder.tests.it.RadioButtonGroupViewIT
2026-09-20T12:06:31.433Z INFO 3845258 --- [Pool-1-worker-3] t.c.s.AnnotationConfigContextLoaderUtils : Could not detect default configuration classes for test class [org.vaadin.addons.dramafinder.tests.it.RadioButtonGroupViewIT]: RadioButtonGroupViewIT does not declare any static, non-private, non-final, nested classes annotated with @Configuration.
2026-09-20T12:06:31.434Z INFO 3845258 --- [Pool-1-worker-3] .b.t.c.SpringBootTestContextBootstrapper : Found @SpringBootConfiguration org.vaadin.addons.dramafinder.tests.TestServer for test class org.vaadin.addons.dramafinder.tests.it.RadioButtonGroupViewIT
2026-09-20T12:06:31.435Z INFO 3845258 --- [Pool-1-worker-3] t.c.s.AnnotationConfigContextLoaderUtils : Could not detect default configuration classes for test class [org.vaadin.addons.dramafinder.tests.it.RadioButtonGroupViewIT]: RadioButtonGroupViewIT does not declare any static, non-private, non-final, nested classes annotated with @Configuration.
2026-09-20T12:06:31.435Z INFO 3845258 --- [Pool-1-worker-3] t.c.s.AnnotationConfigContextLoaderUtils : Could not detect default configuration classes for test class [org.vaadin.addons.dramafinder.tests.it.SpringPlaywrightIT]: SpringPlaywrightIT does not declare any static, non-private, non-final, nested classes annotated with @Configuration.
2026-09-20T12:06:31.436Z INFO 3845258 --- [Pool-1-worker-3] t.c.s.AnnotationConfigContextLoaderUtils : Could not detect default configuration classes for test class [org.vaadin.addons.dramafinder.AbstractBasePlaywrightIT]: AbstractBasePlaywrightIT does not declare any static, non-private, non-final, nested classes annotated with @Configuration.
2026-09-20T12:06:31.436Z INFO 3845258 --- [Pool-1-worker-3] .b.t.c.SpringBootTestContextBootstrapper : Found @SpringBootConfiguration org.vaadin.addons.dramafinder.tests.TestServer for test class org.vaadin.addons.dramafinder.tests.it.RadioButtonGroupViewIT
[INFO] Tests run: 5, Failures: 0, Errors: 0, Skipped: 0, Time elapsed: 8.569 s -- in org.vaadin.addons.dramafinder.tests.it.RadioButtonGroupViewIT
[INFO] Running org.vaadin.addons.dramafinder.tests.it.ButtonViewIT
2026-09-20T12:06:39.998Z INFO 3845258 --- [Pool-1-worker-3] t.c.s.AnnotationConfigContextLoaderUtils : Could not detect default configuration classes for test class [org.vaadin.addons.dramafinder.tests.it.ButtonViewIT]: ButtonViewIT does not declare any static, non-private, non-final, nested classes annotated with @Configuration.
2026-09-20T12:06:40.006Z INFO 3845258 --- [Pool-1-worker-3] .b.t.c.SpringBootTestContextBootstrapper : Found @SpringBootConfiguration org.vaadin.addons.dramafinder.tests.TestServer for test class org.vaadin.addons.dramafinder.tests.it.ButtonViewIT
2026-09-20T12:06:40.007Z INFO 3845258 --- [Pool-1-worker-3] t.c.s.AnnotationConfigContextLoaderUtils : Could not detect default configuration classes for test class [org.vaadin.addons.dramafinder.tests.it.ButtonViewIT]: ButtonViewIT does not declare any static, non-private, non-final, nested classes annotated with @Configuration.
2026-09-20T12:06:40.007Z INFO 3845258 --- [Pool-1-worker-3] t.c.s.AnnotationConfigContextLoaderUtils : Could not detect default configuration classes for test class [org.vaadin.addons.dramafinder.tests.it.SpringPlaywrightIT]: SpringPlaywrightIT does not declare any static, non-private, non-final, nested classes annotated with @Configuration.
2026-09-20T12:06:40.007Z INFO 3845258 --- [Pool-1-worker-3] t.c.s.AnnotationConfigContextLoaderUtils : Could not detect default configuration classes for test class [org.vaadin.addons.dramafinder.AbstractBasePlaywrightIT]: AbstractBasePlaywrightIT does not declare any static, non-private, non-final, nested classes annotated with @Configuration.
2026-09-20T12:06:40.008Z INFO 3845258 --- [Pool-1-worker-3] .b.t.c.SpringBootTestContextBootstrapper : Found @SpringBootConfiguration org.vaadin.addons.dramafinder.tests.TestServer for test class org.vaadin.addons.dramafinder.tests.it.ButtonViewIT
[INFO] Tests run: 33, Failures: 0, Errors: 0, Skipped: 0, Time elapsed: 66.03 s -- in org.vaadin.addons.dramafinder.tests.it.ComboBoxViewIT
[INFO] Running org.vaadin.addons.dramafinder.tests.it.ProgressBarViewIT
2026-09-20T12:07:05.286Z INFO 3845258 --- [Pool-1-worker-1] t.c.s.AnnotationConfigContextLoaderUtils : Could not detect default configuration classes for test class [org.vaadin.addons.dramafinder.tests.it.ProgressBarViewIT]: ProgressBarViewIT does not declare any static, non-private, non-final, nested classes annotated with @Configuration.
2026-09-20T12:07:05.297Z INFO 3845258 --- [Pool-1-worker-1] .b.t.c.SpringBootTestContextBootstrapper : Found @SpringBootConfiguration org.vaadin.addons.dramafinder.tests.TestServer for test class org.vaadin.addons.dramafinder.tests.it.ProgressBarViewIT
2026-09-20T12:07:05.298Z INFO 3845258 --- [Pool-1-worker-1] t.c.s.AnnotationConfigContextLoaderUtils : Could not detect default configuration classes for test class [org.vaadin.addons.dramafinder.tests.it.ProgressBarViewIT]: ProgressBarViewIT does not declare any static, non-private, non-final, nested classes annotated with @Configuration.
2026-09-20T12:07:05.298Z INFO 3845258 --- [Pool-1-worker-1] t.c.s.AnnotationConfigContextLoaderUtils : Could not detect default configuration classes for test class [org.vaadin.addons.dramafinder.tests.it.SpringPlaywrightIT]: SpringPlaywrightIT does not declare any static, non-private, non-final, nested classes annotated with @Configuration.
2026-09-20T12:07:05.299Z INFO 3845258 --- [Pool-1-worker-1] t.c.s.AnnotationConfigContextLoaderUtils : Could not detect default configuration classes for test class [org.vaadin.addons.dramafinder.AbstractBasePlaywrightIT]: AbstractBasePlaywrightIT does not declare any static, non-private, non-final, nested classes annotated with @Configuration.
2026-09-20T12:07:05.299Z INFO 3845258 --- [Pool-1-worker-1] .b.t.c.SpringBootTestContextBootstrapper : Found @SpringBootConfiguration org.vaadin.addons.dramafinder.tests.TestServer for test class org.vaadin.addons.dramafinder.tests.it.ProgressBarViewIT
[ERROR] Tests run: 13, Failures: 1, Errors: 0, Skipped: 0, Time elapsed: 26.52 s <<< FAILURE! -- in org.vaadin.addons.dramafinder.tests.it.ButtonViewIT
[ERROR] org.vaadin.addons.dramafinder.tests.it.ButtonViewIT.testHasThemeVariant -- Time elapsed: 5.978 s <<< FAILURE!
org.opentest4j.AssertionFailedError:
Locator expected to have attribute 'theme'
Expected: small primary
Received: primary small
Call log:
- Assert "hasAttribute" with timeout 5000ms
- waiting for getByRole(AriaRole.BUTTON, new Page.GetByRoleOptions().setName("Combined Variants Button")).and(locator("vaadin-button"))
8 × locator resolved to Combined Variants Button
- unexpected value "primary small"
at com.microsoft.playwright.impl.AssertionsBase.expectImpl(AssertionsBase.java:74)
at com.microsoft.playwright.impl.AssertionsBase.expectImpl(AssertionsBase.java:47)
at com.microsoft.playwright.impl.AssertionsBase.expectImpl(AssertionsBase.java:39)
at com.microsoft.playwright.impl.LocatorAssertionsImpl.hasAttribute(LocatorAssertionsImpl.java:190)
at com.microsoft.playwright.impl.LocatorAssertionsImpl.hasAttribute(LocatorAssertionsImpl.java:170)
at com.microsoft.playwright.assertions.LocatorAssertions.hasAttribute(LocatorAssertions.java:1513)
at org.vaadin.addons.dramafinder.element.shared.HasThemeElement.assertTheme(HasThemeElement.java:26)
at org.vaadin.addons.dramafinder.tests.it.ButtonViewIT.testHasThemeVariant(ButtonViewIT.java:50)
[INFO] Running org.vaadin.addons.dramafinder.tests.it.LoginOverlayViewIT
2026-09-20T12:07:06.528Z INFO 3845258 --- [Pool-1-worker-3] t.c.s.AnnotationConfigContextLoaderUtils : Could not detect default configuration classes for test class [org.vaadin.addons.dramafinder.tests.it.LoginOverlayViewIT]: LoginOverlayViewIT does not declare any static, non-private, non-final, nested classes annotated with @Configuration.
2026-09-20T12:07:06.535Z INFO 3845258 --- [Pool-1-worker-3] .b.t.c.SpringBootTestContextBootstrapper : Found @SpringBootConfiguration org.vaadin.addons.dramafinder.tests.TestServer for test class org.vaadin.addons.dramafinder.tests.it.LoginOverlayViewIT
2026-09-20T12:07:06.536Z INFO 3845258 --- [Pool-1-worker-3] t.c.s.AnnotationConfigContextLoaderUtils : Could not detect default configuration classes for test class [org.vaadin.addons.dramafinder.tests.it.LoginOverlayViewIT]: LoginOverlayViewIT does not declare any static, non-private, non-final, nested classes annotated with @Configuration.
2026-09-20T12:07:06.536Z INFO 3845258 --- [Pool-1-worker-3] t.c.s.AnnotationConfigContextLoaderUtils : Could not detect default configuration classes for test class [org.vaadin.addons.dramafinder.tests.it.SpringPlaywrightIT]: SpringPlaywrightIT does not declare any static, non-private, non-final, nested classes annotated with @Configuration.
2026-09-20T12:07:06.536Z INFO 3845258 --- [Pool-1-worker-3] t.c.s.AnnotationConfigContextLoaderUtils : Could not detect default configuration classes for test class [org.vaadin.addons.dramafinder.AbstractBasePlaywrightIT]: AbstractBasePlaywrightIT does not declare any static, non-private, non-final, nested classes annotated with @Configuration.
2026-09-20T12:07:06.537Z INFO 3845258 --- [Pool-1-worker-3] .b.t.c.SpringBootTestContextBootstrapper : Found @SpringBootConfiguration org.vaadin.addons.dramafinder.tests.TestServer for test class org.vaadin.addons.dramafinder.tests.it.LoginOverlayViewIT
[INFO] Tests run: 4, Failures: 0, Errors: 0, Skipped: 0, Time elapsed: 6.775 s -- in org.vaadin.addons.dramafinder.tests.it.ProgressBarViewIT
[INFO] Running org.vaadin.addons.dramafinder.tests.it.NotificationViewIT
2026-09-20T12:07:12.054Z INFO 3845258 --- [Pool-1-worker-1] t.c.s.AnnotationConfigContextLoaderUtils : Could not detect default configuration classes for test class [org.vaadin.addons.dramafinder.tests.it.NotificationViewIT]: NotificationViewIT does not declare any static, non-private, non-final, nested classes annotated with @Configuration.
2026-09-20T12:07:12.056Z INFO 3845258 --- [Pool-1-worker-1] .b.t.c.SpringBootTestContextBootstrapper : Found @SpringBootConfiguration org.vaadin.addons.dramafinder.tests.TestServer for test class org.vaadin.addons.dramafinder.tests.it.NotificationViewIT
2026-09-20T12:07:12.057Z INFO 3845258 --- [Pool-1-worker-1] t.c.s.AnnotationConfigContextLoaderUtils : Could not detect default configuration classes for test class [org.vaadin.addons.dramafinder.tests.it.NotificationViewIT]: NotificationViewIT does not declare any static, non-private, non-final, nested classes annotated with @Configuration.
2026-09-20T12:07:12.058Z INFO 3845258 --- [Pool-1-worker-1] t.c.s.AnnotationConfigContextLoaderUtils : Could not detect default configuration classes for test class [org.vaadin.addons.dramafinder.tests.it.SpringPlaywrightIT]: SpringPlaywrightIT does not declare any static, non-private, non-final, nested classes annotated with @Configuration.
2026-09-20T12:07:12.058Z INFO 3845258 --- [Pool-1-worker-1] t.c.s.AnnotationConfigContextLoaderUtils : Could not detect default configuration classes for test class [org.vaadin.addons.dramafinder.AbstractBasePlaywrightIT]: AbstractBasePlaywrightIT does not declare any static, non-private, non-final, nested classes annotated with @Configuration.
2026-09-20T12:07:12.061Z INFO 3845258 --- [Pool-1-worker-1] .b.t.c.SpringBootTestContextBootstrapper : Found @SpringBootConfiguration org.vaadin.addons.dramafinder.tests.TestServer for test class org.vaadin.addons.dramafinder.tests.it.NotificationViewIT
[INFO] Tests run: 5, Failures: 0, Errors: 0, Skipped: 0, Time elapsed: 10.82 s -- in org.vaadin.addons.dramafinder.tests.it.LoginOverlayViewIT
[INFO] Running org.vaadin.addons.dramafinder.tests.it.DateTimePickerViewIT
2026-09-20T12:07:17.351Z INFO 3845258 --- [Pool-1-worker-3] t.c.s.AnnotationConfigContextLoaderUtils : Could not detect default configuration classes for test class [org.vaadin.addons.dramafinder.tests.it.DateTimePickerViewIT]: DateTimePickerViewIT does not declare any static, non-private, non-final, nested classes annotated with @Configuration.
2026-09-20T12:07:17.363Z INFO 3845258 --- [Pool-1-worker-3] .b.t.c.SpringBootTestContextBootstrapper : Found @SpringBootConfiguration org.vaadin.addons.dramafinder.tests.TestServer for test class org.vaadin.addons.dramafinder.tests.it.DateTimePickerViewIT
2026-09-20T12:07:17.363Z INFO 3845258 --- [Pool-1-worker-3] t.c.s.AnnotationConfigContextLoaderUtils : Could not detect default configuration classes for test class [org.vaadin.addons.dramafinder.tests.it.DateTimePickerViewIT]: DateTimePickerViewIT does not declare any static, non-private, non-final, nested classes annotated with @Configuration.
2026-09-20T12:07:17.363Z INFO 3845258 --- [Pool-1-worker-3] t.c.s.AnnotationConfigContextLoaderUtils : Could not detect default configuration classes for test class [org.vaadin.addons.dramafinder.tests.it.SpringPlaywrightIT]: SpringPlaywrightIT does not declare any static, non-private, non-final, nested classes annotated with @Configuration.
2026-09-20T12:07:17.363Z INFO 3845258 --- [Pool-1-worker-3] t.c.s.AnnotationConfigContextLoaderUtils : Could not detect default configuration classes for test class [org.vaadin.addons.dramafinder.AbstractBasePlaywrightIT]: AbstractBasePlaywrightIT does not declare any static, non-private, non-final, nested classes annotated with @Configuration.
2026-09-20T12:07:17.364Z INFO 3845258 --- [Pool-1-worker-3] .b.t.c.SpringBootTestContextBootstrapper : Found @SpringBootConfiguration org.vaadin.addons.dramafinder.tests.TestServer for test class org.vaadin.addons.dramafinder.tests.it.DateTimePickerViewIT
[INFO] Tests run: 17, Failures: 0, Errors: 0, Skipped: 0, Time elapsed: 49.15 s -- in org.vaadin.addons.dramafinder.tests.it.TreeGridMultiSelectViewIT
[INFO] Running org.vaadin.addons.dramafinder.tests.it.VirtualListViewIT
2026-09-20T12:07:19.459Z INFO 3845258 --- [Pool-1-worker-2] t.c.s.AnnotationConfigContextLoaderUtils : Could not detect default configuration classes for test class [org.vaadin.addons.dramafinder.tests.it.VirtualListViewIT]: VirtualListViewIT does not declare any static, non-private, non-final, nested classes annotated with @Configuration.
2026-09-20T12:07:19.470Z INFO 3845258 --- [Pool-1-worker-2] .b.t.c.SpringBootTestContextBootstrapper : Found @SpringBootConfiguration org.vaadin.addons.dramafinder.tests.TestServer for test class org.vaadin.addons.dramafinder.tests.it.VirtualListViewIT
2026-09-20T12:07:19.470Z INFO 3845258 --- [Pool-1-worker-2] t.c.s.AnnotationConfigContextLoaderUtils : Could not detect default configuration classes for test class [org.vaadin.addons.dramafinder.tests.it.VirtualListViewIT]: VirtualListViewIT does not declare any static, non-private, non-final, nested classes annotated with @Configuration.
2026-09-20T12:07:19.471Z INFO 3845258 --- [Pool-1-worker-2] t.c.s.AnnotationConfigContextLoaderUtils : Could not detect default configuration classes for test class [org.vaadin.addons.dramafinder.tests.it.SpringPlaywrightIT]: SpringPlaywrightIT does not declare any static, non-private, non-final, nested classes annotated with @Configuration.
2026-09-20T12:07:19.471Z INFO 3845258 --- [Pool-1-worker-2] t.c.s.AnnotationConfigContextLoaderUtils : Could not detect default configuration classes for test class [org.vaadin.addons.dramafinder.AbstractBasePlaywrightIT]: AbstractBasePlaywrightIT does not declare any static, non-private, non-final, nested classes annotated with @Configuration.
2026-09-20T12:07:19.471Z INFO 3845258 --- [Pool-1-worker-2] .b.t.c.SpringBootTestContextBootstrapper : Found @SpringBootConfiguration org.vaadin.addons.dramafinder.tests.TestServer for test class org.vaadin.addons.dramafinder.tests.it.VirtualListViewIT
[INFO] Tests run: 6, Failures: 0, Errors: 0, Skipped: 0, Time elapsed: 13.92 s -- in org.vaadin.addons.dramafinder.tests.it.NotificationViewIT
[INFO] Running org.vaadin.addons.dramafinder.tests.it.PasswordFieldGetByLabelIT
2026-09-20T12:07:25.984Z INFO 3845258 --- [Pool-1-worker-1] t.c.s.AnnotationConfigContextLoaderUtils : Could not detect default configuration classes for test class [org.vaadin.addons.dramafinder.tests.it.PasswordFieldGetByLabelIT]: PasswordFieldGetByLabelIT does not declare any static, non-private, non-final, nested classes annotated with @Configuration.
2026-09-20T12:07:25.985Z INFO 3845258 --- [Pool-1-worker-1] .b.t.c.SpringBootTestContextBootstrapper : Found @SpringBootConfiguration org.vaadin.addons.dramafinder.tests.TestServer for test class org.vaadin.addons.dramafinder.tests.it.PasswordFieldGetByLabelIT
2026-09-20T12:07:25.987Z INFO 3845258 --- [Pool-1-worker-1] t.c.s.AnnotationConfigContextLoaderUtils : Could not detect default configuration classes for test class [org.vaadin.addons.dramafinder.tests.it.PasswordFieldGetByLabelIT]: PasswordFieldGetByLabelIT does not declare any static, non-private, non-final, nested classes annotated with @Configuration.
2026-09-20T12:07:25.987Z INFO 3845258 --- [Pool-1-worker-1] t.c.s.AnnotationConfigContextLoaderUtils : Could not detect default configuration classes for test class [org.vaadin.addons.dramafinder.tests.it.SpringPlaywrightIT]: SpringPlaywrightIT does not declare any static, non-private, non-final, nested classes annotated with @Configuration.
2026-09-20T12:07:25.988Z INFO 3845258 --- [Pool-1-worker-1] t.c.s.AnnotationConfigContextLoaderUtils : Could not detect default configuration classes for test class [org.vaadin.addons.dramafinder.AbstractBasePlaywrightIT]: AbstractBasePlaywrightIT does not declare any static, non-private, non-final, nested classes annotated with @Configuration.
2026-09-20T12:07:25.988Z INFO 3845258 --- [Pool-1-worker-1] .b.t.c.SpringBootTestContextBootstrapper : Found @SpringBootConfiguration org.vaadin.addons.dramafinder.tests.TestServer for test class org.vaadin.addons.dramafinder.tests.it.PasswordFieldGetByLabelIT
[INFO] Tests run: 2, Failures: 0, Errors: 0, Skipped: 0, Time elapsed: 4.891 s -- in org.vaadin.addons.dramafinder.tests.it.PasswordFieldGetByLabelIT
[INFO] Running org.vaadin.addons.dramafinder.tests.it.UploadViewIT
2026-09-20T12:07:30.881Z INFO 3845258 --- [Pool-1-worker-1] t.c.s.AnnotationConfigContextLoaderUtils : Could not detect default configuration classes for test class [org.vaadin.addons.dramafinder.tests.it.UploadViewIT]: UploadViewIT does not declare any static, non-private, non-final, nested classes annotated with @Configuration.
2026-09-20T12:07:30.887Z INFO 3845258 --- [Pool-1-worker-1] .b.t.c.SpringBootTestContextBootstrapper : Found @SpringBootConfiguration org.vaadin.addons.dramafinder.tests.TestServer for test class org.vaadin.addons.dramafinder.tests.it.UploadViewIT
2026-09-20T12:07:30.888Z INFO 3845258 --- [Pool-1-worker-1] t.c.s.AnnotationConfigContextLoaderUtils : Could not detect default configuration classes for test class [org.vaadin.addons.dramafinder.tests.it.UploadViewIT]: UploadViewIT does not declare any static, non-private, non-final, nested classes annotated with @Configuration.
2026-09-20T12:07:30.888Z INFO 3845258 --- [Pool-1-worker-1] t.c.s.AnnotationConfigContextLoaderUtils : Could not detect default configuration classes for test class [org.vaadin.addons.dramafinder.tests.it.SpringPlaywrightIT]: SpringPlaywrightIT does not declare any static, non-private, non-final, nested classes annotated with @Configuration.
2026-09-20T12:07:30.888Z INFO 3845258 --- [Pool-1-worker-1] t.c.s.AnnotationConfigContextLoaderUtils : Could not detect default configuration classes for test class [org.vaadin.addons.dramafinder.AbstractBasePlaywrightIT]: AbstractBasePlaywrightIT does not declare any static, non-private, non-final, nested classes annotated with @Configuration.
2026-09-20T12:07:30.889Z INFO 3845258 --- [Pool-1-worker-1] .b.t.c.SpringBootTestContextBootstrapper : Found @SpringBootConfiguration org.vaadin.addons.dramafinder.tests.TestServer for test class org.vaadin.addons.dramafinder.tests.it.UploadViewIT
[INFO] Tests run: 3, Failures: 0, Errors: 0, Skipped: 0, Time elapsed: 6.311 s -- in org.vaadin.addons.dramafinder.tests.it.UploadViewIT
[INFO] Running org.vaadin.addons.dramafinder.tests.it.CheckboxViewIT
2026-09-20T12:07:37.189Z INFO 3845258 --- [Pool-1-worker-1] t.c.s.AnnotationConfigContextLoaderUtils : Could not detect default configuration classes for test class [org.vaadin.addons.dramafinder.tests.it.CheckboxViewIT]: CheckboxViewIT does not declare any static, non-private, non-final, nested classes annotated with @Configuration.
2026-09-20T12:07:37.199Z INFO 3845258 --- [Pool-1-worker-1] .b.t.c.SpringBootTestContextBootstrapper : Found @SpringBootConfiguration org.vaadin.addons.dramafinder.tests.TestServer for test class org.vaadin.addons.dramafinder.tests.it.CheckboxViewIT
2026-09-20T12:07:37.201Z INFO 3845258 --- [Pool-1-worker-1] t.c.s.AnnotationConfigContextLoaderUtils : Could not detect default configuration classes for test class [org.vaadin.addons.dramafinder.tests.it.CheckboxViewIT]: CheckboxViewIT does not declare any static, non-private, non-final, nested classes annotated with @Configuration.
2026-09-20T12:07:37.201Z INFO 3845258 --- [Pool-1-worker-1] t.c.s.AnnotationConfigContextLoaderUtils : Could not detect default configuration classes for test class [org.vaadin.addons.dramafinder.tests.it.SpringPlaywrightIT]: SpringPlaywrightIT does not declare any static, non-private, non-final, nested classes annotated with @Configuration.
2026-09-20T12:07:37.204Z INFO 3845258 --- [Pool-1-worker-1] t.c.s.AnnotationConfigContextLoaderUtils : Could not detect default configuration classes for test class [org.vaadin.addons.dramafinder.AbstractBasePlaywrightIT]: AbstractBasePlaywrightIT does not declare any static, non-private, non-final, nested classes annotated with @Configuration.
2026-09-20T12:07:37.208Z INFO 3845258 --- [Pool-1-worker-1] .b.t.c.SpringBootTestContextBootstrapper : Found @SpringBootConfiguration org.vaadin.addons.dramafinder.tests.TestServer for test class org.vaadin.addons.dramafinder.tests.it.CheckboxViewIT
[INFO] Tests run: 10, Failures: 0, Errors: 0, Skipped: 0, Time elapsed: 21.25 s -- in org.vaadin.addons.dramafinder.tests.it.DateTimePickerViewIT
[INFO] Running org.vaadin.addons.dramafinder.tests.it.GridDetailsViewIT
2026-09-20T12:07:38.607Z INFO 3845258 --- [Pool-1-worker-3] t.c.s.AnnotationConfigContextLoaderUtils : Could not detect default configuration classes for test class [org.vaadin.addons.dramafinder.tests.it.GridDetailsViewIT]: GridDetailsViewIT does not declare any static, non-private, non-final, nested classes annotated with @Configuration.
2026-09-20T12:07:38.608Z INFO 3845258 --- [Pool-1-worker-3] .b.t.c.SpringBootTestContextBootstrapper : Found @SpringBootConfiguration org.vaadin.addons.dramafinder.tests.TestServer for test class org.vaadin.addons.dramafinder.tests.it.GridDetailsViewIT
2026-09-20T12:07:38.609Z INFO 3845258 --- [Pool-1-worker-3] t.c.s.AnnotationConfigContextLoaderUtils : Could not detect default configuration classes for test class [org.vaadin.addons.dramafinder.tests.it.GridDetailsViewIT]: GridDetailsViewIT does not declare any static, non-private, non-final, nested classes annotated with @Configuration.
2026-09-20T12:07:38.611Z INFO 3845258 --- [Pool-1-worker-3] t.c.s.AnnotationConfigContextLoaderUtils : Could not detect default configuration classes for test class [org.vaadin.addons.dramafinder.tests.it.SpringPlaywrightIT]: SpringPlaywrightIT does not declare any static, non-private, non-final, nested classes annotated with @Configuration.
2026-09-20T12:07:38.611Z INFO 3845258 --- [Pool-1-worker-3] t.c.s.AnnotationConfigContextLoaderUtils : Could not detect default configuration classes for test class [org.vaadin.addons.dramafinder.AbstractBasePlaywrightIT]: AbstractBasePlaywrightIT does not declare any static, non-private, non-final, nested classes annotated with @Configuration.
2026-09-20T12:07:38.611Z INFO 3845258 --- [Pool-1-worker-3] .b.t.c.SpringBootTestContextBootstrapper : Found @SpringBootConfiguration org.vaadin.addons.dramafinder.tests.TestServer for test class org.vaadin.addons.dramafinder.tests.it.GridDetailsViewIT
[INFO] Tests run: 5, Failures: 0, Errors: 0, Skipped: 0, Time elapsed: 10.88 s -- in org.vaadin.addons.dramafinder.tests.it.GridDetailsViewIT
[INFO] Running org.vaadin.addons.dramafinder.tests.it.AccordionViewIT
2026-09-20T12:07:49.490Z INFO 3845258 --- [Pool-1-worker-3] t.c.s.AnnotationConfigContextLoaderUtils : Could not detect default configuration classes for test class [org.vaadin.addons.dramafinder.tests.it.AccordionViewIT]: AccordionViewIT does not declare any static, non-private, non-final, nested classes annotated with @Configuration.
2026-09-20T12:07:49.495Z INFO 3845258 --- [Pool-1-worker-3] .b.t.c.SpringBootTestContextBootstrapper : Found @SpringBootConfiguration org.vaadin.addons.dramafinder.tests.TestServer for test class org.vaadin.addons.dramafinder.tests.it.AccordionViewIT
2026-09-20T12:07:49.496Z INFO 3845258 --- [Pool-1-worker-3] t.c.s.AnnotationConfigContextLoaderUtils : Could not detect default configuration classes for test class [org.vaadin.addons.dramafinder.tests.it.AccordionViewIT]: AccordionViewIT does not declare any static, non-private, non-final, nested classes annotated with @Configuration.
2026-09-20T12:07:49.498Z INFO 3845258 --- [Pool-1-worker-3] t.c.s.AnnotationConfigContextLoaderUtils : Could not detect default configuration classes for test class [org.vaadin.addons.dramafinder.tests.it.SpringPlaywrightIT]: SpringPlaywrightIT does not declare any static, non-private, non-final, nested classes annotated with @Configuration.
2026-09-20T12:07:49.501Z INFO 3845258 --- [Pool-1-worker-3] t.c.s.AnnotationConfigContextLoaderUtils : Could not detect default configuration classes for test class [org.vaadin.addons.dramafinder.AbstractBasePlaywrightIT]: AbstractBasePlaywrightIT does not declare any static, non-private, non-final, nested classes annotated with @Configuration.
2026-09-20T12:07:49.504Z INFO 3845258 --- [Pool-1-worker-3] .b.t.c.SpringBootTestContextBootstrapper : Found @SpringBootConfiguration org.vaadin.addons.dramafinder.tests.TestServer for test class org.vaadin.addons.dramafinder.tests.it.AccordionViewIT
[INFO] Tests run: 11, Failures: 0, Errors: 0, Skipped: 0, Time elapsed: 18.81 s -- in org.vaadin.addons.dramafinder.tests.it.CheckboxViewIT
[INFO] Running org.vaadin.addons.dramafinder.tests.it.TextFieldViewIT
2026-09-20T12:07:56.014Z INFO 3845258 --- [Pool-1-worker-1] t.c.s.AnnotationConfigContextLoaderUtils : Could not detect default configuration classes for test class [org.vaadin.addons.dramafinder.tests.it.TextFieldViewIT]: TextFieldViewIT does not declare any static, non-private, non-final, nested classes annotated with @Configuration.
2026-09-20T12:07:56.022Z INFO 3845258 --- [Pool-1-worker-1] .b.t.c.SpringBootTestContextBootstrapper : Found @SpringBootConfiguration org.vaadin.addons.dramafinder.tests.TestServer for test class org.vaadin.addons.dramafinder.tests.it.TextFieldViewIT
2026-09-20T12:07:56.026Z INFO 3845258 --- [Pool-1-worker-1] t.c.s.AnnotationConfigContextLoaderUtils : Could not detect default configuration classes for test class [org.vaadin.addons.dramafinder.tests.it.TextFieldViewIT]: TextFieldViewIT does not declare any static, non-private, non-final, nested classes annotated with @Configuration.
2026-09-20T12:07:56.026Z INFO 3845258 --- [Pool-1-worker-1] t.c.s.AnnotationConfigContextLoaderUtils : Could not detect default configuration classes for test class [org.vaadin.addons.dramafinder.tests.it.SpringPlaywrightIT]: SpringPlaywrightIT does not declare any static, non-private, non-final, nested classes annotated with @Configuration.
2026-09-20T12:07:56.027Z INFO 3845258 --- [Pool-1-worker-1] t.c.s.AnnotationConfigContextLoaderUtils : Could not detect default configuration classes for test class [org.vaadin.addons.dramafinder.AbstractBasePlaywrightIT]: AbstractBasePlaywrightIT does not declare any static, non-private, non-final, nested classes annotated with @Configuration.
2026-09-20T12:07:56.027Z INFO 3845258 --- [Pool-1-worker-1] .b.t.c.SpringBootTestContextBootstrapper : Found @SpringBootConfiguration org.vaadin.addons.dramafinder.tests.TestServer for test class org.vaadin.addons.dramafinder.tests.it.TextFieldViewIT
[INFO] Tests run: 3, Failures: 0, Errors: 0, Skipped: 0, Time elapsed: 6.581 s -- in org.vaadin.addons.dramafinder.tests.it.AccordionViewIT
[INFO] Running org.vaadin.addons.dramafinder.tests.it.MarkdownViewIT
2026-09-20T12:07:56.076Z INFO 3845258 --- [Pool-1-worker-3] t.c.s.AnnotationConfigContextLoaderUtils : Could not detect default configuration classes for test class [org.vaadin.addons.dramafinder.tests.it.MarkdownViewIT]: MarkdownViewIT does not declare any static, non-private, non-final, nested classes annotated with @Configuration.
2026-09-20T12:07:56.080Z INFO 3845258 --- [Pool-1-worker-3] .b.t.c.SpringBootTestContextBootstrapper : Found @SpringBootConfiguration org.vaadin.addons.dramafinder.tests.TestServer for test class org.vaadin.addons.dramafinder.tests.it.MarkdownViewIT
2026-09-20T12:07:56.081Z INFO 3845258 --- [Pool-1-worker-3] t.c.s.AnnotationConfigContextLoaderUtils : Could not detect default configuration classes for test class [org.vaadin.addons.dramafinder.tests.it.MarkdownViewIT]: MarkdownViewIT does not declare any static, non-private, non-final, nested classes annotated with @Configuration.
2026-09-20T12:07:56.081Z INFO 3845258 --- [Pool-1-worker-3] t.c.s.AnnotationConfigContextLoaderUtils : Could not detect default configuration classes for test class [org.vaadin.addons.dramafinder.tests.it.SpringPlaywrightIT]: SpringPlaywrightIT does not declare any static, non-private, non-final, nested classes annotated with @Configuration.
2026-09-20T12:07:56.081Z INFO 3845258 --- [Pool-1-worker-3] t.c.s.AnnotationConfigContextLoaderUtils : Could not detect default configuration classes for test class [org.vaadin.addons.dramafinder.AbstractBasePlaywrightIT]: AbstractBasePlaywrightIT does not declare any static, non-private, non-final, nested classes annotated with @Configuration.
2026-09-20T12:07:56.082Z INFO 3845258 --- [Pool-1-worker-3] .b.t.c.SpringBootTestContextBootstrapper : Found @SpringBootConfiguration org.vaadin.addons.dramafinder.tests.TestServer for test class org.vaadin.addons.dramafinder.tests.it.MarkdownViewIT
[INFO] Tests run: 21, Failures: 0, Errors: 0, Skipped: 0, Time elapsed: 38.35 s -- in org.vaadin.addons.dramafinder.tests.it.VirtualListViewIT
[INFO] Running org.vaadin.addons.dramafinder.tests.it.CardViewIT
2026-09-20T12:07:57.823Z INFO 3845258 --- [Pool-1-worker-2] t.c.s.AnnotationConfigContextLoaderUtils : Could not detect default configuration classes for test class [org.vaadin.addons.dramafinder.tests.it.CardViewIT]: CardViewIT does not declare any static, non-private, non-final, nested classes annotated with @Configuration.
2026-09-20T12:07:57.824Z INFO 3845258 --- [Pool-1-worker-2] .b.t.c.SpringBootTestContextBootstrapper : Found @SpringBootConfiguration org.vaadin.addons.dramafinder.tests.TestServer for test class org.vaadin.addons.dramafinder.tests.it.CardViewIT
2026-09-20T12:07:57.831Z INFO 3845258 --- [Pool-1-worker-2] t.c.s.AnnotationConfigContextLoaderUtils : Could not detect default configuration classes for test class [org.vaadin.addons.dramafinder.tests.it.CardViewIT]: CardViewIT does not declare any static, non-private, non-final, nested classes annotated with @Configuration.
2026-09-20T12:07:57.831Z INFO 3845258 --- [Pool-1-worker-2] t.c.s.AnnotationConfigContextLoaderUtils : Could not detect default configuration classes for test class [org.vaadin.addons.dramafinder.tests.it.SpringPlaywrightIT]: SpringPlaywrightIT does not declare any static, non-private, non-final, nested classes annotated with @Configuration.
2026-09-20T12:07:57.831Z INFO 3845258 --- [Pool-1-worker-2] t.c.s.AnnotationConfigContextLoaderUtils : Could not detect default configuration classes for test class [org.vaadin.addons.dramafinder.AbstractBasePlaywrightIT]: AbstractBasePlaywrightIT does not declare any static, non-private, non-final, nested classes annotated with @Configuration.
2026-09-20T12:07:57.832Z INFO 3845258 --- [Pool-1-worker-2] .b.t.c.SpringBootTestContextBootstrapper : Found @SpringBootConfiguration org.vaadin.addons.dramafinder.tests.TestServer for test class org.vaadin.addons.dramafinder.tests.it.CardViewIT
[INFO] Tests run: 2, Failures: 0, Errors: 0, Skipped: 0, Time elapsed: 3.793 s -- in org.vaadin.addons.dramafinder.tests.it.CardViewIT
[INFO] Running org.vaadin.addons.dramafinder.tests.it.EmailFieldGetByLabelIT
2026-09-20T12:08:01.612Z INFO 3845258 --- [Pool-1-worker-2] t.c.s.AnnotationConfigContextLoaderUtils : Could not detect default configuration classes for test class [org.vaadin.addons.dramafinder.tests.it.EmailFieldGetByLabelIT]: EmailFieldGetByLabelIT does not declare any static, non-private, non-final, nested classes annotated with @Configuration.
2026-09-20T12:08:01.614Z INFO 3845258 --- [Pool-1-worker-2] .b.t.c.SpringBootTestContextBootstrapper : Found @SpringBootConfiguration org.vaadin.addons.dramafinder.tests.TestServer for test class org.vaadin.addons.dramafinder.tests.it.EmailFieldGetByLabelIT
2026-09-20T12:08:01.615Z INFO 3845258 --- [Pool-1-worker-2] t.c.s.AnnotationConfigContextLoaderUtils : Could not detect default configuration classes for test class [org.vaadin.addons.dramafinder.tests.it.EmailFieldGetByLabelIT]: EmailFieldGetByLabelIT does not declare any static, non-private, non-final, nested classes annotated with @Configuration.
2026-09-20T12:08:01.616Z INFO 3845258 --- [Pool-1-worker-2] t.c.s.AnnotationConfigContextLoaderUtils : Could not detect default configuration classes for test class [org.vaadin.addons.dramafinder.tests.it.SpringPlaywrightIT]: SpringPlaywrightIT does not declare any static, non-private, non-final, nested classes annotated with @Configuration.
2026-09-20T12:08:01.617Z INFO 3845258 --- [Pool-1-worker-2] t.c.s.AnnotationConfigContextLoaderUtils : Could not detect default configuration classes for test class [org.vaadin.addons.dramafinder.AbstractBasePlaywrightIT]: AbstractBasePlaywrightIT does not declare any static, non-private, non-final, nested classes annotated with @Configuration.
2026-09-20T12:08:01.620Z INFO 3845258 --- [Pool-1-worker-2] .b.t.c.SpringBootTestContextBootstrapper : Found @SpringBootConfiguration org.vaadin.addons.dramafinder.tests.TestServer for test class org.vaadin.addons.dramafinder.tests.it.EmailFieldGetByLabelIT
[INFO] Tests run: 3, Failures: 0, Errors: 0, Skipped: 0, Time elapsed: 6.515 s -- in org.vaadin.addons.dramafinder.tests.it.EmailFieldGetByLabelIT
[INFO] Running org.vaadin.addons.dramafinder.tests.it.TextAreaViewIT
2026-09-20T12:08:08.134Z INFO 3845258 --- [Pool-1-worker-2] t.c.s.AnnotationConfigContextLoaderUtils : Could not detect default configuration classes for test class [org.vaadin.addons.dramafinder.tests.it.TextAreaViewIT]: TextAreaViewIT does not declare any static, non-private, non-final, nested classes annotated with @Configuration.
2026-09-20T12:08:08.137Z INFO 3845258 --- [Pool-1-worker-2] .b.t.c.SpringBootTestContextBootstrapper : Found @SpringBootConfiguration org.vaadin.addons.dramafinder.tests.TestServer for test class org.vaadin.addons.dramafinder.tests.it.TextAreaViewIT
2026-09-20T12:08:08.138Z INFO 3845258 --- [Pool-1-worker-2] t.c.s.AnnotationConfigContextLoaderUtils : Could not detect default configuration classes for test class [org.vaadin.addons.dramafinder.tests.it.TextAreaViewIT]: TextAreaViewIT does not declare any static, non-private, non-final, nested classes annotated with @Configuration.
2026-09-20T12:08:08.138Z INFO 3845258 --- [Pool-1-worker-2] t.c.s.AnnotationConfigContextLoaderUtils : Could not detect default configuration classes for test class [org.vaadin.addons.dramafinder.tests.it.SpringPlaywrightIT]: SpringPlaywrightIT does not declare any static, non-private, non-final, nested classes annotated with @Configuration.
2026-09-20T12:08:08.138Z INFO 3845258 --- [Pool-1-worker-2] t.c.s.AnnotationConfigContextLoaderUtils : Could not detect default configuration classes for test class [org.vaadin.addons.dramafinder.AbstractBasePlaywrightIT]: AbstractBasePlaywrightIT does not declare any static, non-private, non-final, nested classes annotated with @Configuration.
2026-09-20T12:08:08.138Z INFO 3845258 --- [Pool-1-worker-2] .b.t.c.SpringBootTestContextBootstrapper : Found @SpringBootConfiguration org.vaadin.addons.dramafinder.tests.TestServer for test class org.vaadin.addons.dramafinder.tests.it.TextAreaViewIT
[INFO] Tests run: 9, Failures: 0, Errors: 0, Skipped: 0, Time elapsed: 16.08 s -- in org.vaadin.addons.dramafinder.tests.it.MarkdownViewIT
[INFO] Running org.vaadin.addons.dramafinder.tests.it.SelectGetByLabelIT
2026-09-20T12:08:12.156Z INFO 3845258 --- [Pool-1-worker-3] t.c.s.AnnotationConfigContextLoaderUtils : Could not detect default configuration classes for test class [org.vaadin.addons.dramafinder.tests.it.SelectGetByLabelIT]: SelectGetByLabelIT does not declare any static, non-private, non-final, nested classes annotated with @Configuration.
2026-09-20T12:08:12.160Z INFO 3845258 --- [Pool-1-worker-3] .b.t.c.SpringBootTestContextBootstrapper : Found @SpringBootConfiguration org.vaadin.addons.dramafinder.tests.TestServer for test class org.vaadin.addons.dramafinder.tests.it.SelectGetByLabelIT
2026-09-20T12:08:12.165Z INFO 3845258 --- [Pool-1-worker-3] t.c.s.AnnotationConfigContextLoaderUtils : Could not detect default configuration classes for test class [org.vaadin.addons.dramafinder.tests.it.SelectGetByLabelIT]: SelectGetByLabelIT does not declare any static, non-private, non-final, nested classes annotated with @Configuration.
2026-09-20T12:08:12.166Z INFO 3845258 --- [Pool-1-worker-3] t.c.s.AnnotationConfigContextLoaderUtils : Could not detect default configuration classes for test class [org.vaadin.addons.dramafinder.tests.it.SpringPlaywrightIT]: SpringPlaywrightIT does not declare any static, non-private, non-final, nested classes annotated with @Configuration.
2026-09-20T12:08:12.166Z INFO 3845258 --- [Pool-1-worker-3] t.c.s.AnnotationConfigContextLoaderUtils : Could not detect default configuration classes for test class [org.vaadin.addons.dramafinder.AbstractBasePlaywrightIT]: AbstractBasePlaywrightIT does not declare any static, non-private, non-final, nested classes annotated with @Configuration.
2026-09-20T12:08:12.168Z INFO 3845258 --- [Pool-1-worker-3] .b.t.c.SpringBootTestContextBootstrapper : Found @SpringBootConfiguration org.vaadin.addons.dramafinder.tests.TestServer for test class org.vaadin.addons.dramafinder.tests.it.SelectGetByLabelIT
[INFO] Tests run: 2, Failures: 0, Errors: 0, Skipped: 0, Time elapsed: 4.578 s -- in org.vaadin.addons.dramafinder.tests.it.SelectGetByLabelIT
[INFO] Running org.vaadin.addons.dramafinder.tests.it.AgentReportingIT
2026-09-20T12:08:16.731Z INFO 3845258 --- [Pool-1-worker-3] t.c.s.AnnotationConfigContextLoaderUtils : Could not detect default configuration classes for test class [org.vaadin.addons.dramafinder.tests.it.AgentReportingIT]: AgentReportingIT does not declare any static, non-private, non-final, nested classes annotated with @Configuration.
2026-09-20T12:08:16.736Z INFO 3845258 --- [Pool-1-worker-3] .b.t.c.SpringBootTestContextBootstrapper : Found @SpringBootConfiguration org.vaadin.addons.dramafinder.tests.TestServer for test class org.vaadin.addons.dramafinder.tests.it.AgentReportingIT
2026-09-20T12:08:16.737Z INFO 3845258 --- [Pool-1-worker-3] t.c.s.AnnotationConfigContextLoaderUtils : Could not detect default configuration classes for test class [org.vaadin.addons.dramafinder.tests.it.AgentReportingIT]: AgentReportingIT does not declare any static, non-private, non-final, nested classes annotated with @Configuration.
2026-09-20T12:08:16.737Z INFO 3845258 --- [Pool-1-worker-3] t.c.s.AnnotationConfigContextLoaderUtils : Could not detect default configuration classes for test class [org.vaadin.addons.dramafinder.tests.it.SpringPlaywrightIT]: SpringPlaywrightIT does not declare any static, non-private, non-final, nested classes annotated with @Configuration.
2026-09-20T12:08:16.737Z INFO 3845258 --- [Pool-1-worker-3] t.c.s.AnnotationConfigContextLoaderUtils : Could not detect default configuration classes for test class [org.vaadin.addons.dramafinder.AbstractBasePlaywrightIT]: AbstractBasePlaywrightIT does not declare any static, non-private, non-final, nested classes annotated with @Configuration.
2026-09-20T12:08:16.737Z INFO 3845258 --- [Pool-1-worker-3] .b.t.c.SpringBootTestContextBootstrapper : Found @SpringBootConfiguration org.vaadin.addons.dramafinder.tests.TestServer for test class org.vaadin.addons.dramafinder.tests.it.AgentReportingIT
[INFO] Tests run: 6, Failures: 0, Errors: 0, Skipped: 0, Time elapsed: 12.36 s -- in org.vaadin.addons.dramafinder.tests.it.AgentReportingIT
[INFO] Running org.vaadin.addons.dramafinder.tests.it.MessageInputViewIT
2026-09-20T12:08:29.097Z INFO 3845258 --- [Pool-1-worker-3] t.c.s.AnnotationConfigContextLoaderUtils : Could not detect default configuration classes for test class [org.vaadin.addons.dramafinder.tests.it.MessageInputViewIT]: MessageInputViewIT does not declare any static, non-private, non-final, nested classes annotated with @Configuration.
2026-09-20T12:08:29.099Z INFO 3845258 --- [Pool-1-worker-3] .b.t.c.SpringBootTestContextBootstrapper : Found @SpringBootConfiguration org.vaadin.addons.dramafinder.tests.TestServer for test class org.vaadin.addons.dramafinder.tests.it.MessageInputViewIT
2026-09-20T12:08:29.100Z INFO 3845258 --- [Pool-1-worker-3] t.c.s.AnnotationConfigContextLoaderUtils : Could not detect default configuration classes for test class [org.vaadin.addons.dramafinder.tests.it.MessageInputViewIT]: MessageInputViewIT does not declare any static, non-private, non-final, nested classes annotated with @Configuration.
2026-09-20T12:08:29.100Z INFO 3845258 --- [Pool-1-worker-3] t.c.s.AnnotationConfigContextLoaderUtils : Could not detect default configuration classes for test class [org.vaadin.addons.dramafinder.tests.it.SpringPlaywrightIT]: SpringPlaywrightIT does not declare any static, non-private, non-final, nested classes annotated with @Configuration.
2026-09-20T12:08:29.101Z INFO 3845258 --- [Pool-1-worker-3] t.c.s.AnnotationConfigContextLoaderUtils : Could not detect default configuration classes for test class [org.vaadin.addons.dramafinder.AbstractBasePlaywrightIT]: AbstractBasePlaywrightIT does not declare any static, non-private, non-final, nested classes annotated with @Configuration.
2026-09-20T12:08:29.101Z INFO 3845258 --- [Pool-1-worker-3] .b.t.c.SpringBootTestContextBootstrapper : Found @SpringBootConfiguration org.vaadin.addons.dramafinder.tests.TestServer for test class org.vaadin.addons.dramafinder.tests.it.MessageInputViewIT
[INFO] Tests run: 24, Failures: 0, Errors: 0, Skipped: 0, Time elapsed: 41.50 s -- in org.vaadin.addons.dramafinder.tests.it.TextFieldViewIT
[INFO] Running org.vaadin.addons.dramafinder.tests.it.ComboBoxGetByLabelIT
2026-09-20T12:08:37.512Z INFO 3845258 --- [Pool-1-worker-1] t.c.s.AnnotationConfigContextLoaderUtils : Could not detect default configuration classes for test class [org.vaadin.addons.dramafinder.tests.it.ComboBoxGetByLabelIT]: ComboBoxGetByLabelIT does not declare any static, non-private, non-final, nested classes annotated with @Configuration.
2026-09-20T12:08:37.513Z INFO 3845258 --- [Pool-1-worker-1] .b.t.c.SpringBootTestContextBootstrapper : Found @SpringBootConfiguration org.vaadin.addons.dramafinder.tests.TestServer for test class org.vaadin.addons.dramafinder.tests.it.ComboBoxGetByLabelIT
2026-09-20T12:08:37.517Z INFO 3845258 --- [Pool-1-worker-1] t.c.s.AnnotationConfigContextLoaderUtils : Could not detect default configuration classes for test class [org.vaadin.addons.dramafinder.tests.it.ComboBoxGetByLabelIT]: ComboBoxGetByLabelIT does not declare any static, non-private, non-final, nested classes annotated with @Configuration.
2026-09-20T12:08:37.517Z INFO 3845258 --- [Pool-1-worker-1] t.c.s.AnnotationConfigContextLoaderUtils : Could not detect default configuration classes for test class [org.vaadin.addons.dramafinder.tests.it.SpringPlaywrightIT]: SpringPlaywrightIT does not declare any static, non-private, non-final, nested classes annotated with @Configuration.
2026-09-20T12:08:37.517Z INFO 3845258 --- [Pool-1-worker-1] t.c.s.AnnotationConfigContextLoaderUtils : Could not detect default configuration classes for test class [org.vaadin.addons.dramafinder.AbstractBasePlaywrightIT]: AbstractBasePlaywrightIT does not declare any static, non-private, non-final, nested classes annotated with @Configuration.
2026-09-20T12:08:37.518Z INFO 3845258 --- [Pool-1-worker-1] .b.t.c.SpringBootTestContextBootstrapper : Found @SpringBootConfiguration org.vaadin.addons.dramafinder.tests.TestServer for test class org.vaadin.addons.dramafinder.tests.it.ComboBoxGetByLabelIT
[INFO] Tests run: 8, Failures: 0, Errors: 0, Skipped: 0, Time elapsed: 12.72 s -- in org.vaadin.addons.dramafinder.tests.it.MessageInputViewIT
[INFO] Running org.vaadin.addons.dramafinder.tests.it.DatePickerGetByLabelIT
2026-09-20T12:08:41.817Z INFO 3845258 --- [Pool-1-worker-3] t.c.s.AnnotationConfigContextLoaderUtils : Could not detect default configuration classes for test class [org.vaadin.addons.dramafinder.tests.it.DatePickerGetByLabelIT]: DatePickerGetByLabelIT does not declare any static, non-private, non-final, nested classes annotated with @Configuration.
2026-09-20T12:08:41.818Z INFO 3845258 --- [Pool-1-worker-3] .b.t.c.SpringBootTestContextBootstrapper : Found @SpringBootConfiguration org.vaadin.addons.dramafinder.tests.TestServer for test class org.vaadin.addons.dramafinder.tests.it.DatePickerGetByLabelIT
2026-09-20T12:08:41.819Z INFO 3845258 --- [Pool-1-worker-3] t.c.s.AnnotationConfigContextLoaderUtils : Could not detect default configuration classes for test class [org.vaadin.addons.dramafinder.tests.it.DatePickerGetByLabelIT]: DatePickerGetByLabelIT does not declare any static, non-private, non-final, nested classes annotated with @Configuration.
2026-09-20T12:08:41.819Z INFO 3845258 --- [Pool-1-worker-3] t.c.s.AnnotationConfigContextLoaderUtils : Could not detect default configuration classes for test class [org.vaadin.addons.dramafinder.tests.it.SpringPlaywrightIT]: SpringPlaywrightIT does not declare any static, non-private, non-final, nested classes annotated with @Configuration.
2026-09-20T12:08:41.819Z INFO 3845258 --- [Pool-1-worker-3] t.c.s.AnnotationConfigContextLoaderUtils : Could not detect default configuration classes for test class [org.vaadin.addons.dramafinder.AbstractBasePlaywrightIT]: AbstractBasePlaywrightIT does not declare any static, non-private, non-final, nested classes annotated with @Configuration.
2026-09-20T12:08:41.820Z INFO 3845258 --- [Pool-1-worker-3] .b.t.c.SpringBootTestContextBootstrapper : Found @SpringBootConfiguration org.vaadin.addons.dramafinder.tests.TestServer for test class org.vaadin.addons.dramafinder.tests.it.DatePickerGetByLabelIT
[INFO] Tests run: 3, Failures: 0, Errors: 0, Skipped: 0, Time elapsed: 4.867 s -- in org.vaadin.addons.dramafinder.tests.it.ComboBoxGetByLabelIT
[INFO] Running org.vaadin.addons.dramafinder.tests.it.TextFieldGetByLabelIT
2026-09-20T12:08:42.384Z INFO 3845258 --- [Pool-1-worker-1] t.c.s.AnnotationConfigContextLoaderUtils : Could not detect default configuration classes for test class [org.vaadin.addons.dramafinder.tests.it.TextFieldGetByLabelIT]: TextFieldGetByLabelIT does not declare any static, non-private, non-final, nested classes annotated with @Configuration.
2026-09-20T12:08:42.385Z INFO 3845258 --- [Pool-1-worker-1] .b.t.c.SpringBootTestContextBootstrapper : Found @SpringBootConfiguration org.vaadin.addons.dramafinder.tests.TestServer for test class org.vaadin.addons.dramafinder.tests.it.TextFieldGetByLabelIT
2026-09-20T12:08:42.386Z INFO 3845258 --- [Pool-1-worker-1] t.c.s.AnnotationConfigContextLoaderUtils : Could not detect default configuration classes for test class [org.vaadin.addons.dramafinder.tests.it.TextFieldGetByLabelIT]: TextFieldGetByLabelIT does not declare any static, non-private, non-final, nested classes annotated with @Configuration.
2026-09-20T12:08:42.386Z INFO 3845258 --- [Pool-1-worker-1] t.c.s.AnnotationConfigContextLoaderUtils : Could not detect default configuration classes for test class [org.vaadin.addons.dramafinder.tests.it.SpringPlaywrightIT]: SpringPlaywrightIT does not declare any static, non-private, non-final, nested classes annotated with @Configuration.
2026-09-20T12:08:42.386Z INFO 3845258 --- [Pool-1-worker-1] t.c.s.AnnotationConfigContextLoaderUtils : Could not detect default configuration classes for test class [org.vaadin.addons.dramafinder.AbstractBasePlaywrightIT]: AbstractBasePlaywrightIT does not declare any static, non-private, non-final, nested classes annotated with @Configuration.
2026-09-20T12:08:42.387Z INFO 3845258 --- [Pool-1-worker-1] .b.t.c.SpringBootTestContextBootstrapper : Found @SpringBootConfiguration org.vaadin.addons.dramafinder.tests.TestServer for test class org.vaadin.addons.dramafinder.tests.it.TextFieldGetByLabelIT
[INFO] Tests run: 3, Failures: 0, Errors: 0, Skipped: 0, Time elapsed: 5.193 s -- in org.vaadin.addons.dramafinder.tests.it.DatePickerGetByLabelIT
[INFO] Running org.vaadin.addons.dramafinder.tests.it.DialogViewIT
2026-09-20T12:08:47.015Z INFO 3845258 --- [Pool-1-worker-3] t.c.s.AnnotationConfigContextLoaderUtils : Could not detect default configuration classes for test class [org.vaadin.addons.dramafinder.tests.it.DialogViewIT]: DialogViewIT does not declare any static, non-private, non-final, nested classes annotated with @Configuration.
2026-09-20T12:08:47.015Z INFO 3845258 --- [Pool-1-worker-3] .b.t.c.SpringBootTestContextBootstrapper : Found @SpringBootConfiguration org.vaadin.addons.dramafinder.tests.TestServer for test class org.vaadin.addons.dramafinder.tests.it.DialogViewIT
2026-09-20T12:08:47.016Z INFO 3845258 --- [Pool-1-worker-3] t.c.s.AnnotationConfigContextLoaderUtils : Could not detect default configuration classes for test class [org.vaadin.addons.dramafinder.tests.it.DialogViewIT]: DialogViewIT does not declare any static, non-private, non-final, nested classes annotated with @Configuration.
2026-09-20T12:08:47.022Z INFO 3845258 --- [Pool-1-worker-3] t.c.s.AnnotationConfigContextLoaderUtils : Could not detect default configuration classes for test class [org.vaadin.addons.dramafinder.tests.it.SpringPlaywrightIT]: SpringPlaywrightIT does not declare any static, non-private, non-final, nested classes annotated with @Configuration.
2026-09-20T12:08:47.022Z INFO 3845258 --- [Pool-1-worker-3] t.c.s.AnnotationConfigContextLoaderUtils : Could not detect default configuration classes for test class [org.vaadin.addons.dramafinder.AbstractBasePlaywrightIT]: AbstractBasePlaywrightIT does not declare any static, non-private, non-final, nested classes annotated with @Configuration.
2026-09-20T12:08:47.024Z INFO 3845258 --- [Pool-1-worker-3] .b.t.c.SpringBootTestContextBootstrapper : Found @SpringBootConfiguration org.vaadin.addons.dramafinder.tests.TestServer for test class org.vaadin.addons.dramafinder.tests.it.DialogViewIT
[INFO] Tests run: 23, Failures: 0, Errors: 0, Skipped: 0, Time elapsed: 39.23 s -- in org.vaadin.addons.dramafinder.tests.it.TextAreaViewIT
[INFO] Running org.vaadin.addons.dramafinder.tests.it.BigDecimalFieldGetByLabelIT
2026-09-20T12:08:47.366Z INFO 3845258 --- [Pool-1-worker-2] t.c.s.AnnotationConfigContextLoaderUtils : Could not detect default configuration classes for test class [org.vaadin.addons.dramafinder.tests.it.BigDecimalFieldGetByLabelIT]: BigDecimalFieldGetByLabelIT does not declare any static, non-private, non-final, nested classes annotated with @Configuration.
2026-09-20T12:08:47.367Z INFO 3845258 --- [Pool-1-worker-2] .b.t.c.SpringBootTestContextBootstrapper : Found @SpringBootConfiguration org.vaadin.addons.dramafinder.tests.TestServer for test class org.vaadin.addons.dramafinder.tests.it.BigDecimalFieldGetByLabelIT
2026-09-20T12:08:47.367Z INFO 3845258 --- [Pool-1-worker-2] t.c.s.AnnotationConfigContextLoaderUtils : Could not detect default configuration classes for test class [org.vaadin.addons.dramafinder.tests.it.BigDecimalFieldGetByLabelIT]: BigDecimalFieldGetByLabelIT does not declare any static, non-private, non-final, nested classes annotated with @Configuration.
2026-09-20T12:08:47.368Z INFO 3845258 --- [Pool-1-worker-2] t.c.s.AnnotationConfigContextLoaderUtils : Could not detect default configuration classes for test class [org.vaadin.addons.dramafinder.tests.it.SpringPlaywrightIT]: SpringPlaywrightIT does not declare any static, non-private, non-final, nested classes annotated with @Configuration.
2026-09-20T12:08:47.368Z INFO 3845258 --- [Pool-1-worker-2] t.c.s.AnnotationConfigContextLoaderUtils : Could not detect default configuration classes for test class [org.vaadin.addons.dramafinder.AbstractBasePlaywrightIT]: AbstractBasePlaywrightIT does not declare any static, non-private, non-final, nested classes annotated with @Configuration.
2026-09-20T12:08:47.368Z INFO 3845258 --- [Pool-1-worker-2] .b.t.c.SpringBootTestContextBootstrapper : Found @SpringBootConfiguration org.vaadin.addons.dramafinder.tests.TestServer for test class org.vaadin.addons.dramafinder.tests.it.BigDecimalFieldGetByLabelIT
[INFO] Tests run: 3, Failures: 0, Errors: 0, Skipped: 0, Time elapsed: 4.678 s -- in org.vaadin.addons.dramafinder.tests.it.BigDecimalFieldGetByLabelIT
[INFO] Running org.vaadin.addons.dramafinder.tests.it.TreeGridBasicViewIT
2026-09-20T12:08:52.049Z INFO 3845258 --- [Pool-1-worker-2] t.c.s.AnnotationConfigContextLoaderUtils : Could not detect default configuration classes for test class [org.vaadin.addons.dramafinder.tests.it.TreeGridBasicViewIT]: TreeGridBasicViewIT does not declare any static, non-private, non-final, nested classes annotated with @Configuration.
2026-09-20T12:08:52.056Z INFO 3845258 --- [Pool-1-worker-2] .b.t.c.SpringBootTestContextBootstrapper : Found @SpringBootConfiguration org.vaadin.addons.dramafinder.tests.TestServer for test class org.vaadin.addons.dramafinder.tests.it.TreeGridBasicViewIT
2026-09-20T12:08:52.056Z INFO 3845258 --- [Pool-1-worker-2] t.c.s.AnnotationConfigContextLoaderUtils : Could not detect default configuration classes for test class [org.vaadin.addons.dramafinder.tests.it.TreeGridBasicViewIT]: TreeGridBasicViewIT does not declare any static, non-private, non-final, nested classes annotated with @Configuration.
2026-09-20T12:08:52.057Z INFO 3845258 --- [Pool-1-worker-2] t.c.s.AnnotationConfigContextLoaderUtils : Could not detect default configuration classes for test class [org.vaadin.addons.dramafinder.tests.it.SpringPlaywrightIT]: SpringPlaywrightIT does not declare any static, non-private, non-final, nested classes annotated with @Configuration.
2026-09-20T12:08:52.057Z INFO 3845258 --- [Pool-1-worker-2] t.c.s.AnnotationConfigContextLoaderUtils : Could not detect default configuration classes for test class [org.vaadin.addons.dramafinder.AbstractBasePlaywrightIT]: AbstractBasePlaywrightIT does not declare any static, non-private, non-final, nested classes annotated with @Configuration.
2026-09-20T12:08:52.057Z INFO 3845258 --- [Pool-1-worker-2] .b.t.c.SpringBootTestContextBootstrapper : Found @SpringBootConfiguration org.vaadin.addons.dramafinder.tests.TestServer for test class org.vaadin.addons.dramafinder.tests.it.TreeGridBasicViewIT
[INFO] Tests run: 8, Failures: 0, Errors: 0, Skipped: 0, Time elapsed: 11.73 s -- in org.vaadin.addons.dramafinder.tests.it.TextFieldGetByLabelIT
[INFO] Running org.vaadin.addons.dramafinder.tests.it.TimePickerGetByLabelIT
2026-09-20T12:08:54.113Z INFO 3845258 --- [Pool-1-worker-1] t.c.s.AnnotationConfigContextLoaderUtils : Could not detect default configuration classes for test class [org.vaadin.addons.dramafinder.tests.it.TimePickerGetByLabelIT]: TimePickerGetByLabelIT does not declare any static, non-private, non-final, nested classes annotated with @Configuration.
2026-09-20T12:08:54.114Z INFO 3845258 --- [Pool-1-worker-1] .b.t.c.SpringBootTestContextBootstrapper : Found @SpringBootConfiguration org.vaadin.addons.dramafinder.tests.TestServer for test class org.vaadin.addons.dramafinder.tests.it.TimePickerGetByLabelIT
2026-09-20T12:08:54.115Z INFO 3845258 --- [Pool-1-worker-1] t.c.s.AnnotationConfigContextLoaderUtils : Could not detect default configuration classes for test class [org.vaadin.addons.dramafinder.tests.it.TimePickerGetByLabelIT]: TimePickerGetByLabelIT does not declare any static, non-private, non-final, nested classes annotated with @Configuration.
2026-09-20T12:08:54.115Z INFO 3845258 --- [Pool-1-worker-1] t.c.s.AnnotationConfigContextLoaderUtils : Could not detect default configuration classes for test class [org.vaadin.addons.dramafinder.tests.it.SpringPlaywrightIT]: SpringPlaywrightIT does not declare any static, non-private, non-final, nested classes annotated with @Configuration.
2026-09-20T12:08:54.115Z INFO 3845258 --- [Pool-1-worker-1] t.c.s.AnnotationConfigContextLoaderUtils : Could not detect default configuration classes for test class [org.vaadin.addons.dramafinder.AbstractBasePlaywrightIT]: AbstractBasePlaywrightIT does not declare any static, non-private, non-final, nested classes annotated with @Configuration.
2026-09-20T12:08:54.115Z INFO 3845258 --- [Pool-1-worker-1] .b.t.c.SpringBootTestContextBootstrapper : Found @SpringBootConfiguration org.vaadin.addons.dramafinder.tests.TestServer for test class org.vaadin.addons.dramafinder.tests.it.TimePickerGetByLabelIT
[INFO] Tests run: 5, Failures: 0, Errors: 0, Skipped: 0, Time elapsed: 11.50 s -- in org.vaadin.addons.dramafinder.tests.it.DialogViewIT
[INFO] Running org.vaadin.addons.dramafinder.tests.it.SideNavigationElementViewIT
2026-09-20T12:08:58.530Z INFO 3845258 --- [Pool-1-worker-3] t.c.s.AnnotationConfigContextLoaderUtils : Could not detect default configuration classes for test class [org.vaadin.addons.dramafinder.tests.it.SideNavigationElementViewIT]: SideNavigationElementViewIT does not declare any static, non-private, non-final, nested classes annotated with @Configuration.
2026-09-20T12:08:58.535Z INFO 3845258 --- [Pool-1-worker-3] .b.t.c.SpringBootTestContextBootstrapper : Found @SpringBootConfiguration org.vaadin.addons.dramafinder.tests.TestServer for test class org.vaadin.addons.dramafinder.tests.it.SideNavigationElementViewIT
2026-09-20T12:08:58.536Z INFO 3845258 --- [Pool-1-worker-3] t.c.s.AnnotationConfigContextLoaderUtils : Could not detect default configuration classes for test class [org.vaadin.addons.dramafinder.tests.it.SideNavigationElementViewIT]: SideNavigationElementViewIT does not declare any static, non-private, non-final, nested classes annotated with @Configuration.
2026-09-20T12:08:58.536Z INFO 3845258 --- [Pool-1-worker-3] t.c.s.AnnotationConfigContextLoaderUtils : Could not detect default configuration classes for test class [org.vaadin.addons.dramafinder.tests.it.SpringPlaywrightIT]: SpringPlaywrightIT does not declare any static, non-private, non-final, nested classes annotated with @Configuration.
2026-09-20T12:08:58.537Z INFO 3845258 --- [Pool-1-worker-3] t.c.s.AnnotationConfigContextLoaderUtils : Could not detect default configuration classes for test class [org.vaadin.addons.dramafinder.AbstractBasePlaywrightIT]: AbstractBasePlaywrightIT does not declare any static, non-private, non-final, nested classes annotated with @Configuration.
2026-09-20T12:08:58.544Z INFO 3845258 --- [Pool-1-worker-3] .b.t.c.SpringBootTestContextBootstrapper : Found @SpringBootConfiguration org.vaadin.addons.dramafinder.tests.TestServer for test class org.vaadin.addons.dramafinder.tests.it.SideNavigationElementViewIT
[INFO] Tests run: 3, Failures: 0, Errors: 0, Skipped: 0, Time elapsed: 5.215 s -- in org.vaadin.addons.dramafinder.tests.it.TimePickerGetByLabelIT
[INFO] Running org.vaadin.addons.dramafinder.tests.it.GridBasicViewIT
2026-09-20T12:08:59.335Z INFO 3845258 --- [Pool-1-worker-1] t.c.s.AnnotationConfigContextLoaderUtils : Could not detect default configuration classes for test class [org.vaadin.addons.dramafinder.tests.it.GridBasicViewIT]: GridBasicViewIT does not declare any static, non-private, non-final, nested classes annotated with @Configuration.
2026-09-20T12:08:59.341Z INFO 3845258 --- [Pool-1-worker-1] .b.t.c.SpringBootTestContextBootstrapper : Found @SpringBootConfiguration org.vaadin.addons.dramafinder.tests.TestServer for test class org.vaadin.addons.dramafinder.tests.it.GridBasicViewIT
2026-09-20T12:08:59.348Z INFO 3845258 --- [Pool-1-worker-1] t.c.s.AnnotationConfigContextLoaderUtils : Could not detect default configuration classes for test class [org.vaadin.addons.dramafinder.tests.it.GridBasicViewIT]: GridBasicViewIT does not declare any static, non-private, non-final, nested classes annotated with @Configuration.
2026-09-20T12:08:59.354Z INFO 3845258 --- [Pool-1-worker-1] t.c.s.AnnotationConfigContextLoaderUtils : Could not detect default configuration classes for test class [org.vaadin.addons.dramafinder.tests.it.SpringPlaywrightIT]: SpringPlaywrightIT does not declare any static, non-private, non-final, nested classes annotated with @Configuration.
2026-09-20T12:08:59.355Z INFO 3845258 --- [Pool-1-worker-1] t.c.s.AnnotationConfigContextLoaderUtils : Could not detect default configuration classes for test class [org.vaadin.addons.dramafinder.AbstractBasePlaywrightIT]: AbstractBasePlaywrightIT does not declare any static, non-private, non-final, nested classes annotated with @Configuration.
2026-09-20T12:08:59.356Z INFO 3845258 --- [Pool-1-worker-1] .b.t.c.SpringBootTestContextBootstrapper : Found @SpringBootConfiguration org.vaadin.addons.dramafinder.tests.TestServer for test class org.vaadin.addons.dramafinder.tests.it.GridBasicViewIT
[INFO] Tests run: 8, Failures: 0, Errors: 0, Skipped: 0, Time elapsed: 14.37 s -- in org.vaadin.addons.dramafinder.tests.it.SideNavigationElementViewIT
[INFO] Running org.vaadin.addons.dramafinder.tests.it.AvatarViewIT
2026-09-20T12:09:12.894Z INFO 3845258 --- [Pool-1-worker-3] t.c.s.AnnotationConfigContextLoaderUtils : Could not detect default configuration classes for test class [org.vaadin.addons.dramafinder.tests.it.AvatarViewIT]: AvatarViewIT does not declare any static, non-private, non-final, nested classes annotated with @Configuration.
2026-09-20T12:09:12.903Z INFO 3845258 --- [Pool-1-worker-3] .b.t.c.SpringBootTestContextBootstrapper : Found @SpringBootConfiguration org.vaadin.addons.dramafinder.tests.TestServer for test class org.vaadin.addons.dramafinder.tests.it.AvatarViewIT
2026-09-20T12:09:12.903Z INFO 3845258 --- [Pool-1-worker-3] t.c.s.AnnotationConfigContextLoaderUtils : Could not detect default configuration classes for test class [org.vaadin.addons.dramafinder.tests.it.AvatarViewIT]: AvatarViewIT does not declare any static, non-private, non-final, nested classes annotated with @Configuration.
2026-09-20T12:09:12.903Z INFO 3845258 --- [Pool-1-worker-3] t.c.s.AnnotationConfigContextLoaderUtils : Could not detect default configuration classes for test class [org.vaadin.addons.dramafinder.tests.it.SpringPlaywrightIT]: SpringPlaywrightIT does not declare any static, non-private, non-final, nested classes annotated with @Configuration.
2026-09-20T12:09:12.903Z INFO 3845258 --- [Pool-1-worker-3] t.c.s.AnnotationConfigContextLoaderUtils : Could not detect default configuration classes for test class [org.vaadin.addons.dramafinder.AbstractBasePlaywrightIT]: AbstractBasePlaywrightIT does not declare any static, non-private, non-final, nested classes annotated with @Configuration.
2026-09-20T12:09:12.904Z INFO 3845258 --- [Pool-1-worker-3] .b.t.c.SpringBootTestContextBootstrapper : Found @SpringBootConfiguration org.vaadin.addons.dramafinder.tests.TestServer for test class org.vaadin.addons.dramafinder.tests.it.AvatarViewIT
[INFO] Tests run: 16, Failures: 0, Errors: 0, Skipped: 0, Time elapsed: 33.75 s -- in org.vaadin.addons.dramafinder.tests.it.TreeGridBasicViewIT
[INFO] Running org.vaadin.addons.dramafinder.tests.it.DateTimePickerGetByLabelIT
2026-09-20T12:09:25.805Z INFO 3845258 --- [Pool-1-worker-2] t.c.s.AnnotationConfigContextLoaderUtils : Could not detect default configuration classes for test class [org.vaadin.addons.dramafinder.tests.it.DateTimePickerGetByLabelIT]: DateTimePickerGetByLabelIT does not declare any static, non-private, non-final, nested classes annotated with @Configuration.
2026-09-20T12:09:25.811Z INFO 3845258 --- [Pool-1-worker-2] .b.t.c.SpringBootTestContextBootstrapper : Found @SpringBootConfiguration org.vaadin.addons.dramafinder.tests.TestServer for test class org.vaadin.addons.dramafinder.tests.it.DateTimePickerGetByLabelIT
2026-09-20T12:09:25.815Z INFO 3845258 --- [Pool-1-worker-2] t.c.s.AnnotationConfigContextLoaderUtils : Could not detect default configuration classes for test class [org.vaadin.addons.dramafinder.tests.it.DateTimePickerGetByLabelIT]: DateTimePickerGetByLabelIT does not declare any static, non-private, non-final, nested classes annotated with @Configuration.
2026-09-20T12:09:25.815Z INFO 3845258 --- [Pool-1-worker-2] t.c.s.AnnotationConfigContextLoaderUtils : Could not detect default configuration classes for test class [org.vaadin.addons.dramafinder.tests.it.SpringPlaywrightIT]: SpringPlaywrightIT does not declare any static, non-private, non-final, nested classes annotated with @Configuration.
2026-09-20T12:09:25.816Z INFO 3845258 --- [Pool-1-worker-2] t.c.s.AnnotationConfigContextLoaderUtils : Could not detect default configuration classes for test class [org.vaadin.addons.dramafinder.AbstractBasePlaywrightIT]: AbstractBasePlaywrightIT does not declare any static, non-private, non-final, nested classes annotated with @Configuration.
2026-09-20T12:09:25.819Z INFO 3845258 --- [Pool-1-worker-2] .b.t.c.SpringBootTestContextBootstrapper : Found @SpringBootConfiguration org.vaadin.addons.dramafinder.tests.TestServer for test class org.vaadin.addons.dramafinder.tests.it.DateTimePickerGetByLabelIT
[INFO] Tests run: 3, Failures: 0, Errors: 0, Skipped: 0, Time elapsed: 4.919 s -- in org.vaadin.addons.dramafinder.tests.it.DateTimePickerGetByLabelIT
[INFO] Running org.vaadin.addons.dramafinder.tests.it.SliderViewIT
2026-09-20T12:09:30.732Z INFO 3845258 --- [Pool-1-worker-2] t.c.s.AnnotationConfigContextLoaderUtils : Could not detect default configuration classes for test class [org.vaadin.addons.dramafinder.tests.it.SliderViewIT]: SliderViewIT does not declare any static, non-private, non-final, nested classes annotated with @Configuration.
2026-09-20T12:09:30.733Z INFO 3845258 --- [Pool-1-worker-2] .b.t.c.SpringBootTestContextBootstrapper : Found @SpringBootConfiguration org.vaadin.addons.dramafinder.tests.TestServer for test class org.vaadin.addons.dramafinder.tests.it.SliderViewIT
2026-09-20T12:09:30.734Z INFO 3845258 --- [Pool-1-worker-2] t.c.s.AnnotationConfigContextLoaderUtils : Could not detect default configuration classes for test class [org.vaadin.addons.dramafinder.tests.it.SliderViewIT]: SliderViewIT does not declare any static, non-private, non-final, nested classes annotated with @Configuration.
2026-09-20T12:09:30.734Z INFO 3845258 --- [Pool-1-worker-2] t.c.s.AnnotationConfigContextLoaderUtils : Could not detect default configuration classes for test class [org.vaadin.addons.dramafinder.tests.it.SpringPlaywrightIT]: SpringPlaywrightIT does not declare any static, non-private, non-final, nested classes annotated with @Configuration.
2026-09-20T12:09:30.740Z INFO 3845258 --- [Pool-1-worker-2] t.c.s.AnnotationConfigContextLoaderUtils : Could not detect default configuration classes for test class [org.vaadin.addons.dramafinder.AbstractBasePlaywrightIT]: AbstractBasePlaywrightIT does not declare any static, non-private, non-final, nested classes annotated with @Configuration.
2026-09-20T12:09:30.741Z INFO 3845258 --- [Pool-1-worker-2] .b.t.c.SpringBootTestContextBootstrapper : Found @SpringBootConfiguration org.vaadin.addons.dramafinder.tests.TestServer for test class org.vaadin.addons.dramafinder.tests.it.SliderViewIT
[INFO] Tests run: 14, Failures: 0, Errors: 0, Skipped: 0, Time elapsed: 22.54 s -- in org.vaadin.addons.dramafinder.tests.it.AvatarViewIT
[INFO] Running org.vaadin.addons.dramafinder.tests.it.BadgeViewIT
2026-09-20T12:09:35.435Z INFO 3845258 --- [Pool-1-worker-3] t.c.s.AnnotationConfigContextLoaderUtils : Could not detect default configuration classes for test class [org.vaadin.addons.dramafinder.tests.it.BadgeViewIT]: BadgeViewIT does not declare any static, non-private, non-final, nested classes annotated with @Configuration.
2026-09-20T12:09:35.438Z INFO 3845258 --- [Pool-1-worker-3] .b.t.c.SpringBootTestContextBootstrapper : Found @SpringBootConfiguration org.vaadin.addons.dramafinder.tests.TestServer for test class org.vaadin.addons.dramafinder.tests.it.BadgeViewIT
2026-09-20T12:09:35.439Z INFO 3845258 --- [Pool-1-worker-3] t.c.s.AnnotationConfigContextLoaderUtils : Could not detect default configuration classes for test class [org.vaadin.addons.dramafinder.tests.it.BadgeViewIT]: BadgeViewIT does not declare any static, non-private, non-final, nested classes annotated with @Configuration.
2026-09-20T12:09:35.439Z INFO 3845258 --- [Pool-1-worker-3] t.c.s.AnnotationConfigContextLoaderUtils : Could not detect default configuration classes for test class [org.vaadin.addons.dramafinder.tests.it.SpringPlaywrightIT]: SpringPlaywrightIT does not declare any static, non-private, non-final, nested classes annotated with @Configuration.
2026-09-20T12:09:35.439Z INFO 3845258 --- [Pool-1-worker-3] t.c.s.AnnotationConfigContextLoaderUtils : Could not detect default configuration classes for test class [org.vaadin.addons.dramafinder.AbstractBasePlaywrightIT]: AbstractBasePlaywrightIT does not declare any static, non-private, non-final, nested classes annotated with @Configuration.
2026-09-20T12:09:35.443Z INFO 3845258 --- [Pool-1-worker-3] .b.t.c.SpringBootTestContextBootstrapper : Found @SpringBootConfiguration org.vaadin.addons.dramafinder.tests.TestServer for test class org.vaadin.addons.dramafinder.tests.it.BadgeViewIT
[INFO] Tests run: 9, Failures: 0, Errors: 0, Skipped: 0, Time elapsed: 16.19 s -- in org.vaadin.addons.dramafinder.tests.it.SliderViewIT
[INFO] Running org.vaadin.addons.dramafinder.tests.it.GridSortingViewIT
2026-09-20T12:09:46.918Z INFO 3845258 --- [Pool-1-worker-2] t.c.s.AnnotationConfigContextLoaderUtils : Could not detect default configuration classes for test class [org.vaadin.addons.dramafinder.tests.it.GridSortingViewIT]: GridSortingViewIT does not declare any static, non-private, non-final, nested classes annotated with @Configuration.
2026-09-20T12:09:46.919Z INFO 3845258 --- [Pool-1-worker-2] .b.t.c.SpringBootTestContextBootstrapper : Found @SpringBootConfiguration org.vaadin.addons.dramafinder.tests.TestServer for test class org.vaadin.addons.dramafinder.tests.it.GridSortingViewIT
2026-09-20T12:09:46.920Z INFO 3845258 --- [Pool-1-worker-2] t.c.s.AnnotationConfigContextLoaderUtils : Could not detect default configuration classes for test class [org.vaadin.addons.dramafinder.tests.it.GridSortingViewIT]: GridSortingViewIT does not declare any static, non-private, non-final, nested classes annotated with @Configuration.
2026-09-20T12:09:46.923Z INFO 3845258 --- [Pool-1-worker-2] t.c.s.AnnotationConfigContextLoaderUtils : Could not detect default configuration classes for test class [org.vaadin.addons.dramafinder.tests.it.SpringPlaywrightIT]: SpringPlaywrightIT does not declare any static, non-private, non-final, nested classes annotated with @Configuration.
2026-09-20T12:09:46.923Z INFO 3845258 --- [Pool-1-worker-2] t.c.s.AnnotationConfigContextLoaderUtils : Could not detect default configuration classes for test class [org.vaadin.addons.dramafinder.AbstractBasePlaywrightIT]: AbstractBasePlaywrightIT does not declare any static, non-private, non-final, nested classes annotated with @Configuration.
2026-09-20T12:09:46.924Z INFO 3845258 --- [Pool-1-worker-2] .b.t.c.SpringBootTestContextBootstrapper : Found @SpringBootConfiguration org.vaadin.addons.dramafinder.tests.TestServer for test class org.vaadin.addons.dramafinder.tests.it.GridSortingViewIT
[INFO] Tests run: 6, Failures: 0, Errors: 0, Skipped: 0, Time elapsed: 8.510 s -- in org.vaadin.addons.dramafinder.tests.it.GridSortingViewIT
[INFO] Running org.vaadin.addons.dramafinder.tests.it.AmbiguousLabelIT
2026-09-20T12:09:55.425Z INFO 3845258 --- [Pool-1-worker-2] t.c.s.AnnotationConfigContextLoaderUtils : Could not detect default configuration classes for test class [org.vaadin.addons.dramafinder.tests.it.AmbiguousLabelIT]: AmbiguousLabelIT does not declare any static, non-private, non-final, nested classes annotated with @Configuration.
2026-09-20T12:09:55.426Z INFO 3845258 --- [Pool-1-worker-2] .b.t.c.SpringBootTestContextBootstrapper : Found @SpringBootConfiguration org.vaadin.addons.dramafinder.tests.TestServer for test class org.vaadin.addons.dramafinder.tests.it.AmbiguousLabelIT
2026-09-20T12:09:55.427Z INFO 3845258 --- [Pool-1-worker-2] t.c.s.AnnotationConfigContextLoaderUtils : Could not detect default configuration classes for test class [org.vaadin.addons.dramafinder.tests.it.AmbiguousLabelIT]: AmbiguousLabelIT does not declare any static, non-private, non-final, nested classes annotated with @Configuration.
2026-09-20T12:09:55.427Z INFO 3845258 --- [Pool-1-worker-2] t.c.s.AnnotationConfigContextLoaderUtils : Could not detect default configuration classes for test class [org.vaadin.addons.dramafinder.tests.it.SpringPlaywrightIT]: SpringPlaywrightIT does not declare any static, non-private, non-final, nested classes annotated with @Configuration.
2026-09-20T12:09:55.427Z INFO 3845258 --- [Pool-1-worker-2] t.c.s.AnnotationConfigContextLoaderUtils : Could not detect default configuration classes for test class [org.vaadin.addons.dramafinder.AbstractBasePlaywrightIT]: AbstractBasePlaywrightIT does not declare any static, non-private, non-final, nested classes annotated with @Configuration.
2026-09-20T12:09:55.427Z INFO 3845258 --- [Pool-1-worker-2] .b.t.c.SpringBootTestContextBootstrapper : Found @SpringBootConfiguration org.vaadin.addons.dramafinder.tests.TestServer for test class org.vaadin.addons.dramafinder.tests.it.AmbiguousLabelIT
[INFO] Tests run: 12, Failures: 0, Errors: 0, Skipped: 0, Time elapsed: 18.58 s -- in org.vaadin.addons.dramafinder.tests.it.AmbiguousLabelIT
[INFO] Running org.vaadin.addons.dramafinder.tests.it.CheckboxGroupViewIT
2026-09-20T12:10:14.013Z INFO 3845258 --- [Pool-1-worker-2] t.c.s.AnnotationConfigContextLoaderUtils : Could not detect default configuration classes for test class [org.vaadin.addons.dramafinder.tests.it.CheckboxGroupViewIT]: CheckboxGroupViewIT does not declare any static, non-private, non-final, nested classes annotated with @Configuration.
2026-09-20T12:10:14.016Z INFO 3845258 --- [Pool-1-worker-2] .b.t.c.SpringBootTestContextBootstrapper : Found @SpringBootConfiguration org.vaadin.addons.dramafinder.tests.TestServer for test class org.vaadin.addons.dramafinder.tests.it.CheckboxGroupViewIT
2026-09-20T12:10:14.016Z INFO 3845258 --- [Pool-1-worker-2] t.c.s.AnnotationConfigContextLoaderUtils : Could not detect default configuration classes for test class [org.vaadin.addons.dramafinder.tests.it.CheckboxGroupViewIT]: CheckboxGroupViewIT does not declare any static, non-private, non-final, nested classes annotated with @Configuration.
2026-09-20T12:10:14.017Z INFO 3845258 --- [Pool-1-worker-2] t.c.s.AnnotationConfigContextLoaderUtils : Could not detect default configuration classes for test class [org.vaadin.addons.dramafinder.tests.it.SpringPlaywrightIT]: SpringPlaywrightIT does not declare any static, non-private, non-final, nested classes annotated with @Configuration.
2026-09-20T12:10:14.017Z INFO 3845258 --- [Pool-1-worker-2] t.c.s.AnnotationConfigContextLoaderUtils : Could not detect default configuration classes for test class [org.vaadin.addons.dramafinder.AbstractBasePlaywrightIT]: AbstractBasePlaywrightIT does not declare any static, non-private, non-final, nested classes annotated with @Configuration.
2026-09-20T12:10:14.026Z INFO 3845258 --- [Pool-1-worker-2] .b.t.c.SpringBootTestContextBootstrapper : Found @SpringBootConfiguration org.vaadin.addons.dramafinder.tests.TestServer for test class org.vaadin.addons.dramafinder.tests.it.CheckboxGroupViewIT
[INFO] Tests run: 25, Failures: 0, Errors: 0, Skipped: 0, Time elapsed: 42.38 s -- in org.vaadin.addons.dramafinder.tests.it.BadgeViewIT
[INFO] Running org.vaadin.addons.dramafinder.tests.it.TreeGridSelectionViewIT
2026-09-20T12:10:17.828Z INFO 3845258 --- [Pool-1-worker-3] t.c.s.AnnotationConfigContextLoaderUtils : Could not detect default configuration classes for test class [org.vaadin.addons.dramafinder.tests.it.TreeGridSelectionViewIT]: TreeGridSelectionViewIT does not declare any static, non-private, non-final, nested classes annotated with @Configuration.
2026-09-20T12:10:17.840Z INFO 3845258 --- [Pool-1-worker-3] .b.t.c.SpringBootTestContextBootstrapper : Found @SpringBootConfiguration org.vaadin.addons.dramafinder.tests.TestServer for test class org.vaadin.addons.dramafinder.tests.it.TreeGridSelectionViewIT
2026-09-20T12:10:17.841Z INFO 3845258 --- [Pool-1-worker-3] t.c.s.AnnotationConfigContextLoaderUtils : Could not detect default configuration classes for test class [org.vaadin.addons.dramafinder.tests.it.TreeGridSelectionViewIT]: TreeGridSelectionViewIT does not declare any static, non-private, non-final, nested classes annotated with @Configuration.
2026-09-20T12:10:17.841Z INFO 3845258 --- [Pool-1-worker-3] t.c.s.AnnotationConfigContextLoaderUtils : Could not detect default configuration classes for test class [org.vaadin.addons.dramafinder.tests.it.SpringPlaywrightIT]: SpringPlaywrightIT does not declare any static, non-private, non-final, nested classes annotated with @Configuration.
2026-09-20T12:10:17.841Z INFO 3845258 --- [Pool-1-worker-3] t.c.s.AnnotationConfigContextLoaderUtils : Could not detect default configuration classes for test class [org.vaadin.addons.dramafinder.AbstractBasePlaywrightIT]: AbstractBasePlaywrightIT does not declare any static, non-private, non-final, nested classes annotated with @Configuration.
2026-09-20T12:10:17.842Z INFO 3845258 --- [Pool-1-worker-3] .b.t.c.SpringBootTestContextBootstrapper : Found @SpringBootConfiguration org.vaadin.addons.dramafinder.tests.TestServer for test class org.vaadin.addons.dramafinder.tests.it.TreeGridSelectionViewIT
[INFO] Tests run: 12, Failures: 0, Errors: 0, Skipped: 0, Time elapsed: 19.49 s -- in org.vaadin.addons.dramafinder.tests.it.CheckboxGroupViewIT
[INFO] Running org.vaadin.addons.dramafinder.tests.it.GridLitRendererViewIT
2026-09-20T12:10:33.510Z INFO 3845258 --- [Pool-1-worker-2] t.c.s.AnnotationConfigContextLoaderUtils : Could not detect default configuration classes for test class [org.vaadin.addons.dramafinder.tests.it.GridLitRendererViewIT]: GridLitRendererViewIT does not declare any static, non-private, non-final, nested classes annotated with @Configuration.
2026-09-20T12:10:33.515Z INFO 3845258 --- [Pool-1-worker-2] .b.t.c.SpringBootTestContextBootstrapper : Found @SpringBootConfiguration org.vaadin.addons.dramafinder.tests.TestServer for test class org.vaadin.addons.dramafinder.tests.it.GridLitRendererViewIT
2026-09-20T12:10:33.517Z INFO 3845258 --- [Pool-1-worker-2] t.c.s.AnnotationConfigContextLoaderUtils : Could not detect default configuration classes for test class [org.vaadin.addons.dramafinder.tests.it.GridLitRendererViewIT]: GridLitRendererViewIT does not declare any static, non-private, non-final, nested classes annotated with @Configuration.
2026-09-20T12:10:33.517Z INFO 3845258 --- [Pool-1-worker-2] t.c.s.AnnotationConfigContextLoaderUtils : Could not detect default configuration classes for test class [org.vaadin.addons.dramafinder.tests.it.SpringPlaywrightIT]: SpringPlaywrightIT does not declare any static, non-private, non-final, nested classes annotated with @Configuration.
2026-09-20T12:10:33.517Z INFO 3845258 --- [Pool-1-worker-2] t.c.s.AnnotationConfigContextLoaderUtils : Could not detect default configuration classes for test class [org.vaadin.addons.dramafinder.AbstractBasePlaywrightIT]: AbstractBasePlaywrightIT does not declare any static, non-private, non-final, nested classes annotated with @Configuration.
2026-09-20T12:10:33.518Z INFO 3845258 --- [Pool-1-worker-2] .b.t.c.SpringBootTestContextBootstrapper : Found @SpringBootConfiguration org.vaadin.addons.dramafinder.tests.TestServer for test class org.vaadin.addons.dramafinder.tests.it.GridLitRendererViewIT
[INFO] Tests run: 4, Failures: 0, Errors: 0, Skipped: 0, Time elapsed: 7.894 s -- in org.vaadin.addons.dramafinder.tests.it.GridLitRendererViewIT
[INFO] Running org.vaadin.addons.dramafinder.tests.it.NumberFieldViewIT
2026-09-20T12:10:41.400Z INFO 3845258 --- [Pool-1-worker-2] t.c.s.AnnotationConfigContextLoaderUtils : Could not detect default configuration classes for test class [org.vaadin.addons.dramafinder.tests.it.NumberFieldViewIT]: NumberFieldViewIT does not declare any static, non-private, non-final, nested classes annotated with @Configuration.
2026-09-20T12:10:41.401Z INFO 3845258 --- [Pool-1-worker-2] .b.t.c.SpringBootTestContextBootstrapper : Found @SpringBootConfiguration org.vaadin.addons.dramafinder.tests.TestServer for test class org.vaadin.addons.dramafinder.tests.it.NumberFieldViewIT
2026-09-20T12:10:41.411Z INFO 3845258 --- [Pool-1-worker-2] t.c.s.AnnotationConfigContextLoaderUtils : Could not detect default configuration classes for test class [org.vaadin.addons.dramafinder.tests.it.NumberFieldViewIT]: NumberFieldViewIT does not declare any static, non-private, non-final, nested classes annotated with @Configuration.
2026-09-20T12:10:41.411Z INFO 3845258 --- [Pool-1-worker-2] t.c.s.AnnotationConfigContextLoaderUtils : Could not detect default configuration classes for test class [org.vaadin.addons.dramafinder.tests.it.SpringPlaywrightIT]: SpringPlaywrightIT does not declare any static, non-private, non-final, nested classes annotated with @Configuration.
2026-09-20T12:10:41.411Z INFO 3845258 --- [Pool-1-worker-2] t.c.s.AnnotationConfigContextLoaderUtils : Could not detect default configuration classes for test class [org.vaadin.addons.dramafinder.AbstractBasePlaywrightIT]: AbstractBasePlaywrightIT does not declare any static, non-private, non-final, nested classes annotated with @Configuration.
2026-09-20T12:10:41.412Z INFO 3845258 --- [Pool-1-worker-2] .b.t.c.SpringBootTestContextBootstrapper : Found @SpringBootConfiguration org.vaadin.addons.dramafinder.tests.TestServer for test class org.vaadin.addons.dramafinder.tests.it.NumberFieldViewIT
[INFO] Tests run: 4, Failures: 0, Errors: 0, Skipped: 0, Time elapsed: 7.994 s -- in org.vaadin.addons.dramafinder.tests.it.NumberFieldViewIT
[INFO] Running org.vaadin.addons.dramafinder.tests.it.FormLayoutViewIT
2026-09-20T12:10:49.395Z INFO 3845258 --- [Pool-1-worker-2] t.c.s.AnnotationConfigContextLoaderUtils : Could not detect default configuration classes for test class [org.vaadin.addons.dramafinder.tests.it.FormLayoutViewIT]: FormLayoutViewIT does not declare any static, non-private, non-final, nested classes annotated with @Configuration.
2026-09-20T12:10:49.405Z INFO 3845258 --- [Pool-1-worker-2] .b.t.c.SpringBootTestContextBootstrapper : Found @SpringBootConfiguration org.vaadin.addons.dramafinder.tests.TestServer for test class org.vaadin.addons.dramafinder.tests.it.FormLayoutViewIT
2026-09-20T12:10:49.406Z INFO 3845258 --- [Pool-1-worker-2] t.c.s.AnnotationConfigContextLoaderUtils : Could not detect default configuration classes for test class [org.vaadin.addons.dramafinder.tests.it.FormLayoutViewIT]: FormLayoutViewIT does not declare any static, non-private, non-final, nested classes annotated with @Configuration.
2026-09-20T12:10:49.406Z INFO 3845258 --- [Pool-1-worker-2] t.c.s.AnnotationConfigContextLoaderUtils : Could not detect default configuration classes for test class [org.vaadin.addons.dramafinder.tests.it.SpringPlaywrightIT]: SpringPlaywrightIT does not declare any static, non-private, non-final, nested classes annotated with @Configuration.
2026-09-20T12:10:49.406Z INFO 3845258 --- [Pool-1-worker-2] t.c.s.AnnotationConfigContextLoaderUtils : Could not detect default configuration classes for test class [org.vaadin.addons.dramafinder.AbstractBasePlaywrightIT]: AbstractBasePlaywrightIT does not declare any static, non-private, non-final, nested classes annotated with @Configuration.
2026-09-20T12:10:49.407Z INFO 3845258 --- [Pool-1-worker-2] .b.t.c.SpringBootTestContextBootstrapper : Found @SpringBootConfiguration org.vaadin.addons.dramafinder.tests.TestServer for test class org.vaadin.addons.dramafinder.tests.it.FormLayoutViewIT
[INFO] Tests run: 10, Failures: 0, Errors: 0, Skipped: 0, Time elapsed: 16.29 s -- in org.vaadin.addons.dramafinder.tests.it.FormLayoutViewIT
[INFO] Running org.vaadin.addons.dramafinder.tests.it.AvatarGroupViewIT
2026-09-20T12:11:05.691Z INFO 3845258 --- [Pool-1-worker-2] t.c.s.AnnotationConfigContextLoaderUtils : Could not detect default configuration classes for test class [org.vaadin.addons.dramafinder.tests.it.AvatarGroupViewIT]: AvatarGroupViewIT does not declare any static, non-private, non-final, nested classes annotated with @Configuration.
2026-09-20T12:11:05.693Z INFO 3845258 --- [Pool-1-worker-2] .b.t.c.SpringBootTestContextBootstrapper : Found @SpringBootConfiguration org.vaadin.addons.dramafinder.tests.TestServer for test class org.vaadin.addons.dramafinder.tests.it.AvatarGroupViewIT
2026-09-20T12:11:05.694Z INFO 3845258 --- [Pool-1-worker-2] t.c.s.AnnotationConfigContextLoaderUtils : Could not detect default configuration classes for test class [org.vaadin.addons.dramafinder.tests.it.AvatarGroupViewIT]: AvatarGroupViewIT does not declare any static, non-private, non-final, nested classes annotated with @Configuration.
2026-09-20T12:11:05.694Z INFO 3845258 --- [Pool-1-worker-2] t.c.s.AnnotationConfigContextLoaderUtils : Could not detect default configuration classes for test class [org.vaadin.addons.dramafinder.tests.it.SpringPlaywrightIT]: SpringPlaywrightIT does not declare any static, non-private, non-final, nested classes annotated with @Configuration.
2026-09-20T12:11:05.694Z INFO 3845258 --- [Pool-1-worker-2] t.c.s.AnnotationConfigContextLoaderUtils : Could not detect default configuration classes for test class [org.vaadin.addons.dramafinder.AbstractBasePlaywrightIT]: AbstractBasePlaywrightIT does not declare any static, non-private, non-final, nested classes annotated with @Configuration.
2026-09-20T12:11:05.694Z INFO 3845258 --- [Pool-1-worker-2] .b.t.c.SpringBootTestContextBootstrapper : Found @SpringBootConfiguration org.vaadin.addons.dramafinder.tests.TestServer for test class org.vaadin.addons.dramafinder.tests.it.AvatarGroupViewIT
[INFO] Tests run: 31, Failures: 0, Errors: 0, Skipped: 0, Time elapsed: 69.13 s -- in org.vaadin.addons.dramafinder.tests.it.TreeGridSelectionViewIT
[INFO] Tests run: 20, Failures: 0, Errors: 0, Skipped: 0, Time elapsed: 28.00 s -- in org.vaadin.addons.dramafinder.tests.it.AvatarGroupViewIT
[INFO] Tests run: 38, Failures: 0, Errors: 0, Skipped: 0, Time elapsed: 207.5 s -- in org.vaadin.addons.dramafinder.tests.it.GridBasicViewIT
[INFO]
[INFO] Results:
[INFO]
[ERROR] Failures:
[ERROR] ButtonViewIT.testHasThemeVariant:50 Locator expected to have attribute 'theme'
Expected: small primary
Received: primary small
Call log:
- Assert "hasAttribute" with timeout 5000ms
- waiting for getByRole(AriaRole.BUTTON, new Page.GetByRoleOptions().setName("Combined Variants Button")).and(locator("vaadin-button"))
8 × locator resolved to Combined Variants Button
- unexpected value "primary small"
[INFO]
[ERROR] Tests run: 717, Failures: 1, Errors: 0, Skipped: 0
[INFO]
[WARNING] Corrupted channel by directly writing to native stream in forked JVM 1. See FAQ web page and the dump file /home/ghrunner/actions-runner/_work/vaadin-ecosystem-build/vaadin-ecosystem-build/work/dramafinder/target/failsafe-reports/2026-09-20T12-02-56_295-jvmRun1.dumpstream
[INFO]
[INFO] --- failsafe:3.5.4:verify (default) @ dramafinder ---
[INFO] ------------------------------------------------------------------------
[INFO] BUILD FAILURE
[INFO] ------------------------------------------------------------------------
[INFO] Total time: 09:41 min
[INFO] Finished at: 2026-09-20T12:12:27Z
[INFO] ------------------------------------------------------------------------
[ERROR] Failed to execute goal org.apache.maven.plugins:maven-failsafe-plugin:3.5.4:verify (default) on project dramafinder: There are test failures.
[ERROR]
[ERROR] See /home/ghrunner/actions-runner/_work/vaadin-ecosystem-build/vaadin-ecosystem-build/work/dramafinder/target/failsafe-reports for the individual test results.
[ERROR] See dump files (if any exist) [date].dump, [date]-jvmRun[N].dump and [date].dumpstream.
[ERROR] -> [Help 1]
[ERROR]
[ERROR] To see the full stack trace of the errors, re-run Maven with the -e switch.
[ERROR] Re-run Maven using the -X switch to enable full debug logging.
[ERROR]
[ERROR] For more information about the errors and possible solutions, please read the following articles:
[ERROR] [Help 1] http://cwiki.apache.org/confluence/display/MAVEN/MojoFailureException