fatal: couldn't find remote ref main
error: pathspec 'main' did not match any file(s) known to git
Cloning into 'dramafinder'...
$ mvn versions:set-property -Dproperty=vaadin.version -DnewVersion=25.3.0-rc1 -DgenerateBackupPoms=false -B --no-transfer-progress --settings /home/ghrunner/actions-runner/_work/vaadin-ecosystem-build/vaadin-ecosystem-build/settings.xml
[1;33mjava 25-tem is already installed.[0m
[1;32mUsing java version 25-tem in this shell.[0m
[INFO] Scanning for projects...
[INFO]
[INFO] -------------------< org.vaadin.addons:dramafinder >--------------------
[INFO] Building Drama Finder 1.1.7-SNAPSHOT
[INFO] from pom.xml
[INFO] --------------------------------[ jar ]---------------------------------
[INFO]
[INFO] --- versions:2.22.0:set-property (default-cli) @ dramafinder ---
[INFO] ------------------------------------------------------------------------
[INFO] BUILD SUCCESS
[INFO] ------------------------------------------------------------------------
[INFO] Total time: 1.237 s
[INFO] Finished at: 2026-09-18T12:05:07Z
[INFO] ------------------------------------------------------------------------
$ mvn versions:set -DnewVersion=25.3.0-rc1 -DartifactId=vaadin-bom -DgenerateBackupPoms=false -B --no-transfer-progress --settings /home/ghrunner/actions-runner/_work/vaadin-ecosystem-build/vaadin-ecosystem-build/settings.xml
[1;33mjava 25-tem is already installed.[0m
[1;32mUsing java version 25-tem in this shell.[0m
[INFO] Scanning for projects...
[INFO]
[INFO] -------------------< org.vaadin.addons:dramafinder >--------------------
[INFO] Building Drama Finder 1.1.7-SNAPSHOT
[INFO] from pom.xml
[INFO] --------------------------------[ jar ]---------------------------------
[INFO]
[INFO] --- versions:2.22.0:set (default-cli) @ dramafinder ---
[INFO] Searching for local aggregator root...
[INFO] Local aggregation root: /home/ghrunner/actions-runner/_work/vaadin-ecosystem-build/vaadin-ecosystem-build/work/dramafinder
[INFO] Processing change of org.vaadin.addons:vaadin-bom:1.1.7-SNAPSHOT -> 25.3.0-rc1
[INFO] ------------------------------------------------------------------------
[INFO] BUILD SUCCESS
[INFO] ------------------------------------------------------------------------
[INFO] Total time: 0.873 s
[INFO] Finished at: 2026-09-18T12:05:11Z
[INFO] ------------------------------------------------------------------------
$ mvn clean verify -B --no-transfer-progress --settings /home/ghrunner/actions-runner/_work/vaadin-ecosystem-build/vaadin-ecosystem-build/settings.xml
[1;33mjava 25-tem is already installed.[0m
[1;32mUsing java version 25-tem in this shell.[0m
[INFO] Scanning for projects...
[INFO]
[INFO] -------------------< org.vaadin.addons:dramafinder >--------------------
[INFO] Building Drama Finder 1.1.7-SNAPSHOT
[INFO] from pom.xml
[INFO] --------------------------------[ jar ]---------------------------------
[INFO]
[INFO] --- clean:3.2.0:clean (default-clean) @ dramafinder ---
[INFO]
[INFO] --- jacoco:0.8.14:prepare-agent (default) @ dramafinder ---
[INFO] argLine set to -javaagent:/home/ghrunner/.m2/repository/org/jacoco/org.jacoco.agent/0.8.14/org.jacoco.agent-0.8.14-runtime.jar=destfile=/home/ghrunner/actions-runner/_work/vaadin-ecosystem-build/vaadin-ecosystem-build/work/dramafinder/target/jacoco.exec
[INFO]
[INFO] --- resources:3.3.1:copy-resources (bundle-agent-docs) @ dramafinder ---
[INFO] Copying 1 resource from skills/vaadin-playwright-test to target/classes/META-INF/dramafinder
[INFO] Copying 1 resource from skills/vaadin-playwright-screenshot to target/classes/META-INF/dramafinder
[INFO]
[INFO] --- resources:3.3.1:resources (default-resources) @ dramafinder ---
[INFO] Copying 1 resource from src/main/resources to target/classes
[INFO]
[INFO] --- compiler:3.13.0:compile (default-compile) @ dramafinder ---
[INFO] Recompiling the module because of changed source code.
[INFO] Compiling 90 source files with javac [debug release 21] to target/classes
[INFO]
[INFO] --- resources:3.3.1:testResources (default-testResources) @ dramafinder ---
[INFO] Copying 3 resources from src/test/resources to target/test-classes
[INFO]
[INFO] --- compiler:3.13.0:testCompile (default-testCompile) @ dramafinder ---
[INFO] Recompiling the module because of changed dependency.
[INFO] Compiling 150 source files with javac [debug release 21] to target/test-classes
[WARNING] /home/ghrunner/actions-runner/_work/vaadin-ecosystem-build/vaadin-ecosystem-build/work/dramafinder/src/test/java/org/vaadin/addons/dramafinder/tests/testuis/ButtonView.java:[72,34] BUTTON in com.vaadin.flow.component.icon.VaadinIcon has been deprecated and marked for removal
[WARNING] /home/ghrunner/actions-runner/_work/vaadin-ecosystem-build/vaadin-ecosystem-build/work/dramafinder/src/test/java/org/vaadin/addons/dramafinder/tests/testuis/DialogView.java:[64,15] setModal(boolean) in com.vaadin.flow.component.dialog.Dialog has been deprecated and marked for removal
[WARNING] /home/ghrunner/actions-runner/_work/vaadin-ecosystem-build/vaadin-ecosystem-build/work/dramafinder/src/test/java/org/vaadin/addons/dramafinder/tests/testuis/LoginFormView.java:[52,35] createDefault() in com.vaadin.flow.component.login.LoginI18n has been deprecated and marked for removal
[WARNING] /home/ghrunner/actions-runner/_work/vaadin-ecosystem-build/vaadin-ecosystem-build/work/dramafinder/src/test/java/org/vaadin/addons/dramafinder/tests/testuis/LoginOverlayView.java:[54,35] createDefault() in com.vaadin.flow.component.login.LoginI18n has been deprecated and marked for removal
[WARNING] /home/ghrunner/actions-runner/_work/vaadin-ecosystem-build/vaadin-ecosystem-build/work/dramafinder/src/test/java/org/vaadin/addons/dramafinder/tests/testuis/SideNavigationElementView.java:[30,44] ACCORDION_MENU in com.vaadin.flow.component.icon.VaadinIcon has been deprecated and marked for removal
[INFO] /home/ghrunner/actions-runner/_work/vaadin-ecosystem-build/vaadin-ecosystem-build/work/dramafinder/src/test/java/org/vaadin/addons/dramafinder/tests/testuis/TreeGridView.java: Some input files use or override a deprecated API.
[INFO] /home/ghrunner/actions-runner/_work/vaadin-ecosystem-build/vaadin-ecosystem-build/work/dramafinder/src/test/java/org/vaadin/addons/dramafinder/tests/testuis/TreeGridView.java: Recompile with -Xlint:deprecation for details.
[INFO]
[INFO] --- surefire:3.2.5:test (default-test) @ dramafinder ---
[INFO] Using auto detected provider org.apache.maven.surefire.junitplatform.JUnitPlatformProvider
[INFO]
[INFO] -------------------------------------------------------
[INFO] T E S T S
[INFO] -------------------------------------------------------
[INFO] Running org.vaadin.addons.dramafinder.DocumentationBundledInJarTest
[INFO] Running org.vaadin.addons.dramafinder.element.utils.NumberUtilsTest
[INFO] Tests run: 8, Failures: 0, Errors: 0, Skipped: 0, Time elapsed: 0.095 s -- in org.vaadin.addons.dramafinder.DocumentationBundledInJarTest
[INFO] Tests run: 0, Failures: 0, Errors: 0, Skipped: 0, Time elapsed: 0.102 s -- in org.vaadin.addons.dramafinder.element.utils.NumberUtilsTest
[INFO]
[INFO] Results:
[INFO]
[INFO] Tests run: 8, Failures: 0, Errors: 0, Skipped: 0
[INFO]
[INFO]
[INFO] --- jacoco:0.8.14:report (report) @ dramafinder ---
[INFO] Loading execution data file /home/ghrunner/actions-runner/_work/vaadin-ecosystem-build/vaadin-ecosystem-build/work/dramafinder/target/jacoco.exec
[INFO] Analyzed bundle 'Drama Finder' with 94 classes
[INFO]
[INFO] --- jar:3.4.2:jar (default-jar) @ dramafinder ---
[INFO] Building jar: /home/ghrunner/actions-runner/_work/vaadin-ecosystem-build/vaadin-ecosystem-build/work/dramafinder/target/dramafinder-1.1.7-SNAPSHOT.jar
[INFO]
[INFO] --- failsafe:3.5.4:integration-test (default) @ dramafinder ---
[INFO] Using auto detected provider org.apache.maven.surefire.junitplatform.JUnitPlatformProvider
[INFO]
[INFO] -------------------------------------------------------
[INFO] T E S T S
[INFO] -------------------------------------------------------
[INFO] Running org.vaadin.addons.dramafinder.tests.it.TimePickerViewIT
[INFO] Running org.vaadin.addons.dramafinder.tests.it.SimpleExampleViewIT
12:05:32.458 [ForkJoinPool-1-worker-2] INFO org.springframework.test.context.support.AnnotationConfigContextLoaderUtils -- Could not detect default configuration classes for test class [org.vaadin.addons.dramafinder.tests.it.TimePickerViewIT]: TimePickerViewIT does not declare any static, non-private, non-final, nested classes annotated with @Configuration.
12:05:32.456 [ForkJoinPool-1-worker-1] INFO org.springframework.test.context.support.AnnotationConfigContextLoaderUtils -- Could not detect default configuration classes for test class [org.vaadin.addons.dramafinder.tests.it.SimpleExampleViewIT]: SimpleExampleViewIT does not declare any static, non-private, non-final, nested classes annotated with @Configuration.
12:05:32.852 [ForkJoinPool-1-worker-1] INFO org.springframework.boot.test.context.SpringBootTestContextBootstrapper -- Found @SpringBootConfiguration org.vaadin.addons.dramafinder.tests.TestServer for test class org.vaadin.addons.dramafinder.tests.it.SimpleExampleViewIT
12:05:32.854 [ForkJoinPool-1-worker-2] INFO org.springframework.boot.test.context.SpringBootTestContextBootstrapper -- Found @SpringBootConfiguration org.vaadin.addons.dramafinder.tests.TestServer for test class org.vaadin.addons.dramafinder.tests.it.TimePickerViewIT
12:05:33.050 [ForkJoinPool-1-worker-2] INFO org.springframework.test.context.support.AnnotationConfigContextLoaderUtils -- Could not detect default configuration classes for test class [org.vaadin.addons.dramafinder.tests.it.TimePickerViewIT]: TimePickerViewIT does not declare any static, non-private, non-final, nested classes annotated with @Configuration.
12:05:33.051 [ForkJoinPool-1-worker-2] INFO org.springframework.test.context.support.AnnotationConfigContextLoaderUtils -- Could not detect default configuration classes for test class [org.vaadin.addons.dramafinder.tests.it.SpringPlaywrightIT]: SpringPlaywrightIT does not declare any static, non-private, non-final, nested classes annotated with @Configuration.
12:05:33.051 [ForkJoinPool-1-worker-1] INFO org.springframework.test.context.support.AnnotationConfigContextLoaderUtils -- Could not detect default configuration classes for test class [org.vaadin.addons.dramafinder.tests.it.SimpleExampleViewIT]: SimpleExampleViewIT does not declare any static, non-private, non-final, nested classes annotated with @Configuration.
12:05:33.052 [ForkJoinPool-1-worker-1] INFO org.springframework.test.context.support.AnnotationConfigContextLoaderUtils -- Could not detect default configuration classes for test class [org.vaadin.addons.dramafinder.tests.it.SpringPlaywrightIT]: SpringPlaywrightIT does not declare any static, non-private, non-final, nested classes annotated with @Configuration.
12:05:33.052 [ForkJoinPool-1-worker-1] INFO org.springframework.test.context.support.AnnotationConfigContextLoaderUtils -- Could not detect default configuration classes for test class [org.vaadin.addons.dramafinder.AbstractBasePlaywrightIT]: AbstractBasePlaywrightIT does not declare any static, non-private, non-final, nested classes annotated with @Configuration.
12:05:33.054 [ForkJoinPool-1-worker-1] INFO org.springframework.boot.test.context.SpringBootTestContextBootstrapper -- Found @SpringBootConfiguration org.vaadin.addons.dramafinder.tests.TestServer for test class org.vaadin.addons.dramafinder.tests.it.SimpleExampleViewIT
12:05:33.054 [ForkJoinPool-1-worker-2] INFO org.springframework.test.context.support.AnnotationConfigContextLoaderUtils -- Could not detect default configuration classes for test class [org.vaadin.addons.dramafinder.AbstractBasePlaywrightIT]: AbstractBasePlaywrightIT does not declare any static, non-private, non-final, nested classes annotated with @Configuration.
12:05:33.056 [ForkJoinPool-1-worker-2] INFO org.springframework.boot.test.context.SpringBootTestContextBootstrapper -- Found @SpringBootConfiguration org.vaadin.addons.dramafinder.tests.TestServer for test class org.vaadin.addons.dramafinder.tests.it.TimePickerViewIT
. ____ _ __ _ _
/\\ / ___'_ __ _ _(_)_ __ __ _ \ \ \ \
( ( )\___ | '_ | '_| | '_ \/ _` | \ \ \ \
\\/ ___)| |_)| | | | | || (_| | ) ) ) )
' |____| .__|_| |_|_| |_\__, | / / / /
=========|_|==============|___/=/_/_/_/
:: Spring Boot :: (v4.1.1)
2026-09-18T12:05:36.055Z INFO 2720100 --- [Pool-1-worker-2] o.v.a.d.tests.it.TimePickerViewIT : Starting TimePickerViewIT using Java 25 with PID 2720100 (started by ghrunner in /home/ghrunner/actions-runner/_work/vaadin-ecosystem-build/vaadin-ecosystem-build/work/dramafinder)
2026-09-18T12:05:36.056Z INFO 2720100 --- [Pool-1-worker-2] o.v.a.d.tests.it.TimePickerViewIT : No active profile set, falling back to 1 default profile: "default"
2026-09-18T12:05:37.465Z INFO 2720100 --- [Pool-1-worker-2] o.s.boot.tomcat.TomcatWebServer : Tomcat initialized with port 0 (http)
2026-09-18T12:05:37.484Z INFO 2720100 --- [Pool-1-worker-2] o.apache.catalina.core.StandardService : Starting service [Tomcat]
2026-09-18T12:05:37.485Z INFO 2720100 --- [Pool-1-worker-2] o.apache.catalina.core.StandardEngine : Starting Servlet engine: [Apache Tomcat/11.0.25]
2026-09-18T12:05:37.537Z INFO 2720100 --- [Pool-1-worker-2] b.w.c.s.WebApplicationContextInitializer : Root WebApplicationContext: initialization completed in 1388 ms
2026-09-18T12:05:40.317Z INFO 2720100 --- [Pool-1-worker-2] c.v.f.s.VaadinServletContextInitializer : Search for subclasses and classes with annotations took 2382 ms
2026-09-18T12:05:40.328Z WARN 2720100 --- [Pool-1-worker-2] com.vaadin.experimental.FeatureFlags : Unsupported feature flag is present: com.vaadin.experimental.switchComponent
2026-09-18T12:05:40.329Z WARN 2720100 --- [Pool-1-worker-2] com.vaadin.experimental.FeatureFlags : Unsupported feature flag is present: com.vaadin.experimental.breadcrumbsComponent
2026-09-18T12:05:40.512Z INFO 2720100 --- [Pool-1-worker-2] c.v.b.d.startup.DevModeStartupListener : Starting dev-mode updaters in /home/ghrunner/actions-runner/_work/vaadin-ecosystem-build/vaadin-ecosystem-build/work/dramafinder folder.
2026-09-18T12:05:40.552Z WARN 2720100 --- [Pool-1-worker-2] com.vaadin.experimental.FeatureFlags : Unsupported feature flag is present: com.vaadin.experimental.switchComponent
2026-09-18T12:05:40.553Z WARN 2720100 --- [Pool-1-worker-2] com.vaadin.experimental.FeatureFlags : Unsupported feature flag is present: com.vaadin.experimental.breadcrumbsComponent
2026-09-18T12:05:40.607Z INFO 2720100 --- [Pool-1-worker-2] c.v.f.s.f.s.FullDependenciesScanner : Visited 107 classes. Took 51 ms.
2026-09-18T12:05:40.612Z INFO 2720100 --- [Pool-1-worker-2] c.v.f.s.frontend.BundleValidationUtil : Checking if a development mode bundle build is needed
2026-09-18T12:05:40.902Z INFO 2720100 --- [Pool-1-worker-2] c.v.f.s.frontend.BundleValidationUtil : A development mode bundle build is not needed
2026-09-18T12:05:40.976Z INFO 2720100 --- [in-dev-server-1] c.v.f.s.frontend.TaskCopyFrontendFiles : Copying frontend resources from jar files ...
2026-09-18T12:05:41.254Z INFO 2720100 --- [in-dev-server-1] c.v.f.s.frontend.TaskCopyFrontendFiles : Visited 19 resources. Took 278 ms.
2026-09-18T12:05:42.341Z INFO 2720100 --- [Pool-1-worker-2] org.atmosphere.cpr.AtmosphereFramework : Installed AtmosphereHandler com.vaadin.flow.server.communication.PushAtmosphereHandler mapped to context-path: /*
2026-09-18T12:05:42.342Z INFO 2720100 --- [Pool-1-worker-2] org.atmosphere.cpr.AtmosphereFramework : Installed the following AtmosphereInterceptor mapped to AtmosphereHandler com.vaadin.flow.server.communication.PushAtmosphereHandler
2026-09-18T12:05:42.406Z INFO 2720100 --- [Pool-1-worker-2] org.atmosphere.cpr.AtmosphereFramework : Atmosphere is using org.atmosphere.util.VoidAnnotationProcessor for processing annotation
2026-09-18T12:05:42.413Z INFO 2720100 --- [Pool-1-worker-2] org.atmosphere.util.ForkJoinPool : Using ForkJoinPool java.util.concurrent.ForkJoinPool. Set the org.atmosphere.cpr.broadcaster.maxAsyncWriteThreads to -1 to fully use its power.
2026-09-18T12:05:42.420Z INFO 2720100 --- [Pool-1-worker-2] org.atmosphere.cpr.AtmosphereFramework : Installed WebSocketProtocol org.atmosphere.websocket.protocol.SimpleHttpProtocol
2026-09-18T12:05:42.431Z INFO 2720100 --- [Pool-1-worker-2] o.a.container.JSR356AsyncSupport : JSR 356 Mapping path /VAADIN/push
2026-09-18T12:05:42.449Z INFO 2720100 --- [Pool-1-worker-2] org.atmosphere.cpr.AtmosphereFramework : Installing Default AtmosphereInterceptors
2026-09-18T12:05:42.450Z INFO 2720100 --- [Pool-1-worker-2] org.atmosphere.cpr.AtmosphereFramework : org.atmosphere.interceptor.CorsInterceptor : CORS Interceptor Support
2026-09-18T12:05:42.450Z INFO 2720100 --- [Pool-1-worker-2] org.atmosphere.cpr.AtmosphereFramework : org.atmosphere.interceptor.CacheHeadersInterceptor : Default Response's Headers Interceptor
2026-09-18T12:05:42.451Z INFO 2720100 --- [Pool-1-worker-2] org.atmosphere.cpr.AtmosphereFramework : org.atmosphere.interceptor.PaddingAtmosphereInterceptor : Browser Padding Interceptor Support
2026-09-18T12:05:42.452Z INFO 2720100 --- [Pool-1-worker-2] org.atmosphere.cpr.AtmosphereFramework : org.atmosphere.interceptor.AndroidAtmosphereInterceptor : Android Interceptor Support
2026-09-18T12:05:42.452Z INFO 2720100 --- [Pool-1-worker-2] org.atmosphere.cpr.AtmosphereFramework : org.atmosphere.interceptor.HeartbeatInterceptor : Heartbeat Interceptor Support
2026-09-18T12:05:42.452Z INFO 2720100 --- [Pool-1-worker-2] org.atmosphere.cpr.AtmosphereFramework : org.atmosphere.interceptor.SSEAtmosphereInterceptor : SSE Interceptor Support
2026-09-18T12:05:42.453Z INFO 2720100 --- [Pool-1-worker-2] org.atmosphere.cpr.AtmosphereFramework : org.atmosphere.interceptor.JSONPAtmosphereInterceptor : JSONP Interceptor Support
2026-09-18T12:05:42.455Z INFO 2720100 --- [Pool-1-worker-2] org.atmosphere.cpr.AtmosphereFramework : org.atmosphere.interceptor.JavaScriptProtocol : Atmosphere JavaScript Protocol
2026-09-18T12:05:42.455Z INFO 2720100 --- [Pool-1-worker-2] org.atmosphere.cpr.AtmosphereFramework : org.atmosphere.interceptor.WebSocketMessageSuspendInterceptor : org.atmosphere.interceptor.WebSocketMessageSuspendInterceptor
2026-09-18T12:05:42.455Z INFO 2720100 --- [Pool-1-worker-2] org.atmosphere.cpr.AtmosphereFramework : org.atmosphere.interceptor.OnDisconnectInterceptor : Browser disconnection detection
2026-09-18T12:05:42.455Z INFO 2720100 --- [Pool-1-worker-2] org.atmosphere.cpr.AtmosphereFramework : org.atmosphere.interceptor.IdleResourceInterceptor : org.atmosphere.interceptor.IdleResourceInterceptor
2026-09-18T12:05:42.456Z INFO 2720100 --- [Pool-1-worker-2] org.atmosphere.cpr.AtmosphereFramework : Set org.atmosphere.cpr.AtmosphereInterceptor.disableDefaults to disable them.
2026-09-18T12:05:42.456Z INFO 2720100 --- [Pool-1-worker-2] org.atmosphere.cpr.AtmosphereFramework : Installed AtmosphereInterceptor CORS Interceptor Support with priority FIRST_BEFORE_DEFAULT
2026-09-18T12:05:42.462Z INFO 2720100 --- [Pool-1-worker-2] org.atmosphere.cpr.AtmosphereFramework : Installed AtmosphereInterceptor Default Response's Headers Interceptor with priority AFTER_DEFAULT
2026-09-18T12:05:42.463Z INFO 2720100 --- [Pool-1-worker-2] org.atmosphere.cpr.AtmosphereFramework : Installed AtmosphereInterceptor Browser Padding Interceptor Support with priority AFTER_DEFAULT
2026-09-18T12:05:42.463Z INFO 2720100 --- [Pool-1-worker-2] org.atmosphere.cpr.AtmosphereFramework : Installed AtmosphereInterceptor Android Interceptor Support with priority AFTER_DEFAULT
2026-09-18T12:05:42.463Z INFO 2720100 --- [Pool-1-worker-2] o.a.interceptor.HeartbeatInterceptor : HeartbeatInterceptor configured with padding value 'X', client frequency 0 seconds and server frequency 60 seconds
2026-09-18T12:05:42.464Z INFO 2720100 --- [Pool-1-worker-2] org.atmosphere.cpr.AtmosphereFramework : Installed AtmosphereInterceptor Heartbeat Interceptor Support with priority AFTER_DEFAULT
2026-09-18T12:05:42.464Z INFO 2720100 --- [Pool-1-worker-2] org.atmosphere.cpr.AtmosphereFramework : Installed AtmosphereInterceptor SSE Interceptor Support with priority AFTER_DEFAULT
2026-09-18T12:05:42.464Z INFO 2720100 --- [Pool-1-worker-2] org.atmosphere.cpr.AtmosphereFramework : Installed AtmosphereInterceptor JSONP Interceptor Support with priority AFTER_DEFAULT
2026-09-18T12:05:42.464Z INFO 2720100 --- [Pool-1-worker-2] org.atmosphere.cpr.AtmosphereFramework : Installed AtmosphereInterceptor Atmosphere JavaScript Protocol with priority AFTER_DEFAULT
2026-09-18T12:05:42.467Z INFO 2720100 --- [Pool-1-worker-2] org.atmosphere.cpr.AtmosphereFramework : Installed AtmosphereInterceptor org.atmosphere.interceptor.WebSocketMessageSuspendInterceptor with priority AFTER_DEFAULT
2026-09-18T12:05:42.467Z INFO 2720100 --- [Pool-1-worker-2] org.atmosphere.cpr.AtmosphereFramework : Installed AtmosphereInterceptor Browser disconnection detection with priority AFTER_DEFAULT
2026-09-18T12:05:42.467Z INFO 2720100 --- [Pool-1-worker-2] org.atmosphere.cpr.AtmosphereFramework : Installed AtmosphereInterceptor org.atmosphere.interceptor.IdleResourceInterceptor with priority BEFORE_DEFAULT
2026-09-18T12:05:42.467Z INFO 2720100 --- [Pool-1-worker-2] org.atmosphere.cpr.AtmosphereFramework : Using EndpointMapper class org.atmosphere.util.DefaultEndpointMapper
2026-09-18T12:05:42.467Z INFO 2720100 --- [Pool-1-worker-2] org.atmosphere.cpr.AtmosphereFramework : Using BroadcasterCache: org.atmosphere.cache.UUIDBroadcasterCache
2026-09-18T12:05:42.468Z INFO 2720100 --- [Pool-1-worker-2] org.atmosphere.cpr.AtmosphereFramework : Default Broadcaster Class: org.atmosphere.cpr.DefaultBroadcaster
2026-09-18T12:05:42.468Z INFO 2720100 --- [Pool-1-worker-2] org.atmosphere.cpr.AtmosphereFramework : Broadcaster Shared List Resources: false
2026-09-18T12:05:42.468Z INFO 2720100 --- [Pool-1-worker-2] org.atmosphere.cpr.AtmosphereFramework : Broadcaster Polling Wait Time 100
2026-09-18T12:05:42.468Z INFO 2720100 --- [Pool-1-worker-2] org.atmosphere.cpr.AtmosphereFramework : Shared ExecutorService supported: true
2026-09-18T12:05:42.468Z INFO 2720100 --- [Pool-1-worker-2] org.atmosphere.cpr.AtmosphereFramework : Messaging ExecutorService Pool Size unavailable - Not instance of ThreadPoolExecutor
2026-09-18T12:05:42.468Z INFO 2720100 --- [Pool-1-worker-2] org.atmosphere.cpr.AtmosphereFramework : Async I/O Thread Pool Size: 200
2026-09-18T12:05:42.468Z INFO 2720100 --- [Pool-1-worker-2] org.atmosphere.cpr.AtmosphereFramework : Using BroadcasterFactory: org.atmosphere.cpr.DefaultBroadcasterFactory
2026-09-18T12:05:42.468Z INFO 2720100 --- [Pool-1-worker-2] org.atmosphere.cpr.AtmosphereFramework : Using AtmosphereResurceFactory: org.atmosphere.cpr.DefaultAtmosphereResourceFactory
2026-09-18T12:05:42.468Z INFO 2720100 --- [Pool-1-worker-2] org.atmosphere.cpr.AtmosphereFramework : Using WebSocketProcessor: org.atmosphere.websocket.DefaultWebSocketProcessor
2026-09-18T12:05:42.475Z INFO 2720100 --- [Pool-1-worker-2] org.atmosphere.cpr.AtmosphereFramework : Invoke AtmosphereInterceptor on WebSocket message true
2026-09-18T12:05:42.475Z INFO 2720100 --- [Pool-1-worker-2] org.atmosphere.cpr.AtmosphereFramework : HttpSession supported: true
2026-09-18T12:05:42.475Z INFO 2720100 --- [Pool-1-worker-2] org.atmosphere.cpr.AtmosphereFramework : Atmosphere is using DefaultAtmosphereObjectFactory for dependency injection and object creation
2026-09-18T12:05:42.475Z INFO 2720100 --- [Pool-1-worker-2] org.atmosphere.cpr.AtmosphereFramework : Atmosphere is using async support: org.atmosphere.container.JSR356AsyncSupport running under container: Apache Tomcat/11.0.25 using jakarta.servlet/3.0 and jsr356/WebSocket API
2026-09-18T12:05:42.475Z INFO 2720100 --- [Pool-1-worker-2] org.atmosphere.cpr.AtmosphereFramework : Atmosphere Framework 3.0.5.slf4jvaadin1 started.
2026-09-18T12:05:42.481Z INFO 2720100 --- [Pool-1-worker-2] org.atmosphere.cpr.AtmosphereFramework : Installed AtmosphereInterceptor Track Message Size Interceptor using | with priority BEFORE_DEFAULT
2026-09-18T12:05:42.572Z INFO 2720100 --- [Pool-1-worker-2] c.v.f.s.DefaultDeploymentConfiguration :
Vaadin is running in DEVELOPMENT mode - do not use for production deployments.
2026-09-18T12:05:42.692Z INFO 2720100 --- [Pool-1-worker-2] c.vaadin.copilot.CopilotIndexHtmlLoader : Copilot is disabled
2026-09-18T12:05:42.738Z INFO 2720100 --- [Pool-1-worker-2] o.s.boot.tomcat.TomcatWebServer : Tomcat started on port 44667 (http) with context path '/'
2026-09-18T12:05:42.751Z INFO 2720100 --- [Pool-1-worker-2] o.v.a.d.tests.it.TimePickerViewIT : Started TimePickerViewIT in 7.333 seconds (process running for 12.646)
2026-09-18T12:05:42.763Z INFO 2720100 --- [Pool-1-worker-2] c.v.b.d.DevModeHandlerManagerImpl : Application running at http://localhost:0/
Mockito is currently self-attaching to enable the inline-mock-maker. This will no longer work in future releases of the JDK. Please add Mockito as an agent to your build as described in Mockito's documentation: https://javadoc.io/doc/org.mockito/mockito-core/latest/org.mockito/org/mockito/Mockito.html#0.3
[INFO] Running org.vaadin.addons.dramafinder.tests.it.TabsViewIT
2026-09-18T12:05:42.861Z INFO 2720100 --- [Pool-1-worker-3] t.c.s.AnnotationConfigContextLoaderUtils : Could not detect default configuration classes for test class [org.vaadin.addons.dramafinder.tests.it.TabsViewIT]: TabsViewIT does not declare any static, non-private, non-final, nested classes annotated with @Configuration.
2026-09-18T12:05:42.870Z INFO 2720100 --- [Pool-1-worker-3] .b.t.c.SpringBootTestContextBootstrapper : Found @SpringBootConfiguration org.vaadin.addons.dramafinder.tests.TestServer for test class org.vaadin.addons.dramafinder.tests.it.TabsViewIT
2026-09-18T12:05:42.874Z INFO 2720100 --- [Pool-1-worker-3] t.c.s.AnnotationConfigContextLoaderUtils : Could not detect default configuration classes for test class [org.vaadin.addons.dramafinder.tests.it.TabsViewIT]: TabsViewIT does not declare any static, non-private, non-final, nested classes annotated with @Configuration.
2026-09-18T12:05:42.875Z INFO 2720100 --- [Pool-1-worker-3] t.c.s.AnnotationConfigContextLoaderUtils : Could not detect default configuration classes for test class [org.vaadin.addons.dramafinder.tests.it.SpringPlaywrightIT]: SpringPlaywrightIT does not declare any static, non-private, non-final, nested classes annotated with @Configuration.
2026-09-18T12:05:42.876Z INFO 2720100 --- [Pool-1-worker-3] t.c.s.AnnotationConfigContextLoaderUtils : Could not detect default configuration classes for test class [org.vaadin.addons.dramafinder.AbstractBasePlaywrightIT]: AbstractBasePlaywrightIT does not declare any static, non-private, non-final, nested classes annotated with @Configuration.
2026-09-18T12:05:42.882Z INFO 2720100 --- [Pool-1-worker-3] .b.t.c.SpringBootTestContextBootstrapper : Found @SpringBootConfiguration org.vaadin.addons.dramafinder.tests.TestServer for test class org.vaadin.addons.dramafinder.tests.it.TabsViewIT
OpenJDK 64-Bit Server VM warning: Sharing is only supported for boot loader classes because bootstrap classpath has been appended
WARNING: A Java agent has been loaded dynamically (/home/ghrunner/.m2/repository/net/bytebuddy/byte-buddy-agent/1.18.11/byte-buddy-agent-1.18.11.jar)
WARNING: If a serviceability tool is in use, please run with -XX:+EnableDynamicAgentLoading to hide this warning
WARNING: If a serviceability tool is not in use, please run with -Djdk.instrument.traceUsage for more information
WARNING: Dynamic loading of agents will be disallowed by default in a future release
2026-09-18T12:05:44.598Z INFO 2720100 --- [o-auto-1-exec-4] o.a.c.c.C.[Tomcat].[localhost].[/] : Initializing Spring DispatcherServlet 'dispatcherServlet'
2026-09-18T12:05:44.598Z INFO 2720100 --- [o-auto-1-exec-4] o.s.web.servlet.DispatcherServlet : Initializing Servlet 'dispatcherServlet'
2026-09-18T12:05:44.600Z INFO 2720100 --- [o-auto-1-exec-4] o.s.web.servlet.DispatcherServlet : Completed initialization in 2 ms
[INFO] Tests run: 1, Failures: 0, Errors: 0, Skipped: 0, Time elapsed: 15.81 s -- in org.vaadin.addons.dramafinder.tests.it.SimpleExampleViewIT
[INFO] Running org.vaadin.addons.dramafinder.tests.it.TreeGridExpandCollapseViewIT
2026-09-18T12:05:47.958Z INFO 2720100 --- [Pool-1-worker-1] t.c.s.AnnotationConfigContextLoaderUtils : Could not detect default configuration classes for test class [org.vaadin.addons.dramafinder.tests.it.TreeGridExpandCollapseViewIT]: TreeGridExpandCollapseViewIT does not declare any static, non-private, non-final, nested classes annotated with @Configuration.
2026-09-18T12:05:48.021Z INFO 2720100 --- [Pool-1-worker-1] .b.t.c.SpringBootTestContextBootstrapper : Found @SpringBootConfiguration org.vaadin.addons.dramafinder.tests.TestServer for test class org.vaadin.addons.dramafinder.tests.it.TreeGridExpandCollapseViewIT
2026-09-18T12:05:48.022Z INFO 2720100 --- [Pool-1-worker-1] t.c.s.AnnotationConfigContextLoaderUtils : Could not detect default configuration classes for test class [org.vaadin.addons.dramafinder.tests.it.TreeGridExpandCollapseViewIT]: TreeGridExpandCollapseViewIT does not declare any static, non-private, non-final, nested classes annotated with @Configuration.
2026-09-18T12:05:48.030Z INFO 2720100 --- [Pool-1-worker-1] t.c.s.AnnotationConfigContextLoaderUtils : Could not detect default configuration classes for test class [org.vaadin.addons.dramafinder.tests.it.SpringPlaywrightIT]: SpringPlaywrightIT does not declare any static, non-private, non-final, nested classes annotated with @Configuration.
2026-09-18T12:05:48.031Z INFO 2720100 --- [Pool-1-worker-1] t.c.s.AnnotationConfigContextLoaderUtils : Could not detect default configuration classes for test class [org.vaadin.addons.dramafinder.AbstractBasePlaywrightIT]: AbstractBasePlaywrightIT does not declare any static, non-private, non-final, nested classes annotated with @Configuration.
2026-09-18T12:05:48.032Z INFO 2720100 --- [Pool-1-worker-1] .b.t.c.SpringBootTestContextBootstrapper : Found @SpringBootConfiguration org.vaadin.addons.dramafinder.tests.TestServer for test class org.vaadin.addons.dramafinder.tests.it.TreeGridExpandCollapseViewIT
[INFO] Tests run: 6, Failures: 0, Errors: 0, Skipped: 0, Time elapsed: 15.48 s -- in org.vaadin.addons.dramafinder.tests.it.TabsViewIT
[INFO] Running org.vaadin.addons.dramafinder.tests.it.GridFooterViewIT
2026-09-18T12:05:58.352Z INFO 2720100 --- [Pool-1-worker-3] t.c.s.AnnotationConfigContextLoaderUtils : Could not detect default configuration classes for test class [org.vaadin.addons.dramafinder.tests.it.GridFooterViewIT]: GridFooterViewIT does not declare any static, non-private, non-final, nested classes annotated with @Configuration.
2026-09-18T12:05:58.354Z INFO 2720100 --- [Pool-1-worker-3] .b.t.c.SpringBootTestContextBootstrapper : Found @SpringBootConfiguration org.vaadin.addons.dramafinder.tests.TestServer for test class org.vaadin.addons.dramafinder.tests.it.GridFooterViewIT
2026-09-18T12:05:58.371Z INFO 2720100 --- [Pool-1-worker-3] t.c.s.AnnotationConfigContextLoaderUtils : Could not detect default configuration classes for test class [org.vaadin.addons.dramafinder.tests.it.GridFooterViewIT]: GridFooterViewIT does not declare any static, non-private, non-final, nested classes annotated with @Configuration.
2026-09-18T12:05:58.371Z INFO 2720100 --- [Pool-1-worker-3] t.c.s.AnnotationConfigContextLoaderUtils : Could not detect default configuration classes for test class [org.vaadin.addons.dramafinder.tests.it.SpringPlaywrightIT]: SpringPlaywrightIT does not declare any static, non-private, non-final, nested classes annotated with @Configuration.
2026-09-18T12:05:58.371Z INFO 2720100 --- [Pool-1-worker-3] t.c.s.AnnotationConfigContextLoaderUtils : Could not detect default configuration classes for test class [org.vaadin.addons.dramafinder.AbstractBasePlaywrightIT]: AbstractBasePlaywrightIT does not declare any static, non-private, non-final, nested classes annotated with @Configuration.
2026-09-18T12:05:58.372Z INFO 2720100 --- [Pool-1-worker-3] .b.t.c.SpringBootTestContextBootstrapper : Found @SpringBootConfiguration org.vaadin.addons.dramafinder.tests.TestServer for test class org.vaadin.addons.dramafinder.tests.it.GridFooterViewIT
[INFO] Tests run: 9, Failures: 0, Errors: 0, Skipped: 0, Time elapsed: 32.26 s -- in org.vaadin.addons.dramafinder.tests.it.TimePickerViewIT
[INFO] Running org.vaadin.addons.dramafinder.tests.it.MultiSelectComboBoxViewIT
2026-09-18T12:06:04.382Z INFO 2720100 --- [Pool-1-worker-2] t.c.s.AnnotationConfigContextLoaderUtils : Could not detect default configuration classes for test class [org.vaadin.addons.dramafinder.tests.it.MultiSelectComboBoxViewIT]: MultiSelectComboBoxViewIT does not declare any static, non-private, non-final, nested classes annotated with @Configuration.
2026-09-18T12:06:04.384Z INFO 2720100 --- [Pool-1-worker-2] .b.t.c.SpringBootTestContextBootstrapper : Found @SpringBootConfiguration org.vaadin.addons.dramafinder.tests.TestServer for test class org.vaadin.addons.dramafinder.tests.it.MultiSelectComboBoxViewIT
2026-09-18T12:06:04.385Z INFO 2720100 --- [Pool-1-worker-2] t.c.s.AnnotationConfigContextLoaderUtils : Could not detect default configuration classes for test class [org.vaadin.addons.dramafinder.tests.it.MultiSelectComboBoxViewIT]: MultiSelectComboBoxViewIT does not declare any static, non-private, non-final, nested classes annotated with @Configuration.
2026-09-18T12:06:04.385Z INFO 2720100 --- [Pool-1-worker-2] t.c.s.AnnotationConfigContextLoaderUtils : Could not detect default configuration classes for test class [org.vaadin.addons.dramafinder.tests.it.SpringPlaywrightIT]: SpringPlaywrightIT does not declare any static, non-private, non-final, nested classes annotated with @Configuration.
2026-09-18T12:06:04.385Z INFO 2720100 --- [Pool-1-worker-2] t.c.s.AnnotationConfigContextLoaderUtils : Could not detect default configuration classes for test class [org.vaadin.addons.dramafinder.AbstractBasePlaywrightIT]: AbstractBasePlaywrightIT does not declare any static, non-private, non-final, nested classes annotated with @Configuration.
2026-09-18T12:06:04.386Z INFO 2720100 --- [Pool-1-worker-2] .b.t.c.SpringBootTestContextBootstrapper : Found @SpringBootConfiguration org.vaadin.addons.dramafinder.tests.TestServer for test class org.vaadin.addons.dramafinder.tests.it.MultiSelectComboBoxViewIT
[INFO] Tests run: 7, Failures: 0, Errors: 0, Skipped: 0, Time elapsed: 14.67 s -- in org.vaadin.addons.dramafinder.tests.it.GridFooterViewIT
[INFO] Running org.vaadin.addons.dramafinder.tests.it.LoginFormViewIT
2026-09-18T12:06:13.019Z INFO 2720100 --- [Pool-1-worker-3] t.c.s.AnnotationConfigContextLoaderUtils : Could not detect default configuration classes for test class [org.vaadin.addons.dramafinder.tests.it.LoginFormViewIT]: LoginFormViewIT does not declare any static, non-private, non-final, nested classes annotated with @Configuration.
2026-09-18T12:06:13.031Z INFO 2720100 --- [Pool-1-worker-3] .b.t.c.SpringBootTestContextBootstrapper : Found @SpringBootConfiguration org.vaadin.addons.dramafinder.tests.TestServer for test class org.vaadin.addons.dramafinder.tests.it.LoginFormViewIT
2026-09-18T12:06:13.036Z INFO 2720100 --- [Pool-1-worker-3] t.c.s.AnnotationConfigContextLoaderUtils : Could not detect default configuration classes for test class [org.vaadin.addons.dramafinder.tests.it.LoginFormViewIT]: LoginFormViewIT does not declare any static, non-private, non-final, nested classes annotated with @Configuration.
2026-09-18T12:06:13.037Z INFO 2720100 --- [Pool-1-worker-3] t.c.s.AnnotationConfigContextLoaderUtils : Could not detect default configuration classes for test class [org.vaadin.addons.dramafinder.tests.it.SpringPlaywrightIT]: SpringPlaywrightIT does not declare any static, non-private, non-final, nested classes annotated with @Configuration.
2026-09-18T12:06:13.037Z INFO 2720100 --- [Pool-1-worker-3] t.c.s.AnnotationConfigContextLoaderUtils : Could not detect default configuration classes for test class [org.vaadin.addons.dramafinder.AbstractBasePlaywrightIT]: AbstractBasePlaywrightIT does not declare any static, non-private, non-final, nested classes annotated with @Configuration.
2026-09-18T12:06:13.038Z INFO 2720100 --- [Pool-1-worker-3] .b.t.c.SpringBootTestContextBootstrapper : Found @SpringBootConfiguration org.vaadin.addons.dramafinder.tests.TestServer for test class org.vaadin.addons.dramafinder.tests.it.LoginFormViewIT
[INFO] Tests run: 7, Failures: 0, Errors: 0, Skipped: 0, Time elapsed: 13.27 s -- in org.vaadin.addons.dramafinder.tests.it.LoginFormViewIT
[INFO] Running org.vaadin.addons.dramafinder.tests.it.ListBoxViewIT
2026-09-18T12:06:26.295Z INFO 2720100 --- [Pool-1-worker-3] t.c.s.AnnotationConfigContextLoaderUtils : Could not detect default configuration classes for test class [org.vaadin.addons.dramafinder.tests.it.ListBoxViewIT]: ListBoxViewIT does not declare any static, non-private, non-final, nested classes annotated with @Configuration.
2026-09-18T12:06:26.296Z INFO 2720100 --- [Pool-1-worker-3] .b.t.c.SpringBootTestContextBootstrapper : Found @SpringBootConfiguration org.vaadin.addons.dramafinder.tests.TestServer for test class org.vaadin.addons.dramafinder.tests.it.ListBoxViewIT
2026-09-18T12:06:26.298Z INFO 2720100 --- [Pool-1-worker-3] t.c.s.AnnotationConfigContextLoaderUtils : Could not detect default configuration classes for test class [org.vaadin.addons.dramafinder.tests.it.ListBoxViewIT]: ListBoxViewIT does not declare any static, non-private, non-final, nested classes annotated with @Configuration.
2026-09-18T12:06:26.298Z INFO 2720100 --- [Pool-1-worker-3] t.c.s.AnnotationConfigContextLoaderUtils : Could not detect default configuration classes for test class [org.vaadin.addons.dramafinder.tests.it.SpringPlaywrightIT]: SpringPlaywrightIT does not declare any static, non-private, non-final, nested classes annotated with @Configuration.
2026-09-18T12:06:26.298Z INFO 2720100 --- [Pool-1-worker-3] t.c.s.AnnotationConfigContextLoaderUtils : Could not detect default configuration classes for test class [org.vaadin.addons.dramafinder.AbstractBasePlaywrightIT]: AbstractBasePlaywrightIT does not declare any static, non-private, non-final, nested classes annotated with @Configuration.
2026-09-18T12:06:26.299Z INFO 2720100 --- [Pool-1-worker-3] .b.t.c.SpringBootTestContextBootstrapper : Found @SpringBootConfiguration org.vaadin.addons.dramafinder.tests.TestServer for test class org.vaadin.addons.dramafinder.tests.it.ListBoxViewIT
[INFO] Tests run: 16, Failures: 0, Errors: 0, Skipped: 0, Time elapsed: 51.65 s -- in org.vaadin.addons.dramafinder.tests.it.TreeGridExpandCollapseViewIT
[INFO] Running org.vaadin.addons.dramafinder.tests.it.SwitchViewIT
2026-09-18T12:06:39.605Z INFO 2720100 --- [Pool-1-worker-1] t.c.s.AnnotationConfigContextLoaderUtils : Could not detect default configuration classes for test class [org.vaadin.addons.dramafinder.tests.it.SwitchViewIT]: SwitchViewIT does not declare any static, non-private, non-final, nested classes annotated with @Configuration.
2026-09-18T12:06:39.614Z INFO 2720100 --- [Pool-1-worker-1] .b.t.c.SpringBootTestContextBootstrapper : Found @SpringBootConfiguration org.vaadin.addons.dramafinder.tests.TestServer for test class org.vaadin.addons.dramafinder.tests.it.SwitchViewIT
2026-09-18T12:06:39.619Z INFO 2720100 --- [Pool-1-worker-1] t.c.s.AnnotationConfigContextLoaderUtils : Could not detect default configuration classes for test class [org.vaadin.addons.dramafinder.tests.it.SwitchViewIT]: SwitchViewIT does not declare any static, non-private, non-final, nested classes annotated with @Configuration.
2026-09-18T12:06:39.619Z INFO 2720100 --- [Pool-1-worker-1] t.c.s.AnnotationConfigContextLoaderUtils : Could not detect default configuration classes for test class [org.vaadin.addons.dramafinder.tests.it.SpringPlaywrightIT]: SpringPlaywrightIT does not declare any static, non-private, non-final, nested classes annotated with @Configuration.
2026-09-18T12:06:39.619Z INFO 2720100 --- [Pool-1-worker-1] t.c.s.AnnotationConfigContextLoaderUtils : Could not detect default configuration classes for test class [org.vaadin.addons.dramafinder.AbstractBasePlaywrightIT]: AbstractBasePlaywrightIT does not declare any static, non-private, non-final, nested classes annotated with @Configuration.
2026-09-18T12:06:39.620Z INFO 2720100 --- [Pool-1-worker-1] .b.t.c.SpringBootTestContextBootstrapper : Found @SpringBootConfiguration org.vaadin.addons.dramafinder.tests.TestServer for test class org.vaadin.addons.dramafinder.tests.it.SwitchViewIT
[INFO] Tests run: 9, Failures: 0, Errors: 0, Skipped: 0, Time elapsed: 17.17 s -- in org.vaadin.addons.dramafinder.tests.it.ListBoxViewIT
[INFO] Running org.vaadin.addons.dramafinder.tests.it.GridComponentRendererViewIT
2026-09-18T12:06:43.461Z INFO 2720100 --- [Pool-1-worker-3] t.c.s.AnnotationConfigContextLoaderUtils : Could not detect default configuration classes for test class [org.vaadin.addons.dramafinder.tests.it.GridComponentRendererViewIT]: GridComponentRendererViewIT does not declare any static, non-private, non-final, nested classes annotated with @Configuration.
2026-09-18T12:06:43.464Z INFO 2720100 --- [Pool-1-worker-3] .b.t.c.SpringBootTestContextBootstrapper : Found @SpringBootConfiguration org.vaadin.addons.dramafinder.tests.TestServer for test class org.vaadin.addons.dramafinder.tests.it.GridComponentRendererViewIT
2026-09-18T12:06:43.468Z INFO 2720100 --- [Pool-1-worker-3] t.c.s.AnnotationConfigContextLoaderUtils : Could not detect default configuration classes for test class [org.vaadin.addons.dramafinder.tests.it.GridComponentRendererViewIT]: GridComponentRendererViewIT does not declare any static, non-private, non-final, nested classes annotated with @Configuration.
2026-09-18T12:06:43.468Z INFO 2720100 --- [Pool-1-worker-3] t.c.s.AnnotationConfigContextLoaderUtils : Could not detect default configuration classes for test class [org.vaadin.addons.dramafinder.tests.it.SpringPlaywrightIT]: SpringPlaywrightIT does not declare any static, non-private, non-final, nested classes annotated with @Configuration.
2026-09-18T12:06:43.469Z INFO 2720100 --- [Pool-1-worker-3] t.c.s.AnnotationConfigContextLoaderUtils : Could not detect default configuration classes for test class [org.vaadin.addons.dramafinder.AbstractBasePlaywrightIT]: AbstractBasePlaywrightIT does not declare any static, non-private, non-final, nested classes annotated with @Configuration.
2026-09-18T12:06:43.469Z INFO 2720100 --- [Pool-1-worker-3] .b.t.c.SpringBootTestContextBootstrapper : Found @SpringBootConfiguration org.vaadin.addons.dramafinder.tests.TestServer for test class org.vaadin.addons.dramafinder.tests.it.GridComponentRendererViewIT
[INFO] Tests run: 10, Failures: 0, Errors: 0, Skipped: 0, Time elapsed: 17.86 s -- in org.vaadin.addons.dramafinder.tests.it.SwitchViewIT
[INFO] Running org.vaadin.addons.dramafinder.tests.it.TabSheetViewIT
2026-09-18T12:06:57.465Z INFO 2720100 --- [Pool-1-worker-1] t.c.s.AnnotationConfigContextLoaderUtils : Could not detect default configuration classes for test class [org.vaadin.addons.dramafinder.tests.it.TabSheetViewIT]: TabSheetViewIT does not declare any static, non-private, non-final, nested classes annotated with @Configuration.
2026-09-18T12:06:57.475Z INFO 2720100 --- [Pool-1-worker-1] .b.t.c.SpringBootTestContextBootstrapper : Found @SpringBootConfiguration org.vaadin.addons.dramafinder.tests.TestServer for test class org.vaadin.addons.dramafinder.tests.it.TabSheetViewIT
2026-09-18T12:06:57.476Z INFO 2720100 --- [Pool-1-worker-1] t.c.s.AnnotationConfigContextLoaderUtils : Could not detect default configuration classes for test class [org.vaadin.addons.dramafinder.tests.it.TabSheetViewIT]: TabSheetViewIT does not declare any static, non-private, non-final, nested classes annotated with @Configuration.
2026-09-18T12:06:57.477Z INFO 2720100 --- [Pool-1-worker-1] t.c.s.AnnotationConfigContextLoaderUtils : Could not detect default configuration classes for test class [org.vaadin.addons.dramafinder.tests.it.SpringPlaywrightIT]: SpringPlaywrightIT does not declare any static, non-private, non-final, nested classes annotated with @Configuration.
2026-09-18T12:06:57.477Z INFO 2720100 --- [Pool-1-worker-1] t.c.s.AnnotationConfigContextLoaderUtils : Could not detect default configuration classes for test class [org.vaadin.addons.dramafinder.AbstractBasePlaywrightIT]: AbstractBasePlaywrightIT does not declare any static, non-private, non-final, nested classes annotated with @Configuration.
2026-09-18T12:06:57.487Z INFO 2720100 --- [Pool-1-worker-1] .b.t.c.SpringBootTestContextBootstrapper : Found @SpringBootConfiguration org.vaadin.addons.dramafinder.tests.TestServer for test class org.vaadin.addons.dramafinder.tests.it.TabSheetViewIT
[INFO] Tests run: 7, Failures: 0, Errors: 0, Skipped: 0, Time elapsed: 15.98 s -- in org.vaadin.addons.dramafinder.tests.it.GridComponentRendererViewIT
[INFO] Running org.vaadin.addons.dramafinder.tests.it.TooltipViewIT
2026-09-18T12:06:59.446Z INFO 2720100 --- [Pool-1-worker-3] t.c.s.AnnotationConfigContextLoaderUtils : Could not detect default configuration classes for test class [org.vaadin.addons.dramafinder.tests.it.TooltipViewIT]: TooltipViewIT does not declare any static, non-private, non-final, nested classes annotated with @Configuration.
2026-09-18T12:06:59.449Z INFO 2720100 --- [Pool-1-worker-3] .b.t.c.SpringBootTestContextBootstrapper : Found @SpringBootConfiguration org.vaadin.addons.dramafinder.tests.TestServer for test class org.vaadin.addons.dramafinder.tests.it.TooltipViewIT
2026-09-18T12:06:59.450Z INFO 2720100 --- [Pool-1-worker-3] t.c.s.AnnotationConfigContextLoaderUtils : Could not detect default configuration classes for test class [org.vaadin.addons.dramafinder.tests.it.TooltipViewIT]: TooltipViewIT does not declare any static, non-private, non-final, nested classes annotated with @Configuration.
2026-09-18T12:06:59.450Z INFO 2720100 --- [Pool-1-worker-3] t.c.s.AnnotationConfigContextLoaderUtils : Could not detect default configuration classes for test class [org.vaadin.addons.dramafinder.tests.it.SpringPlaywrightIT]: SpringPlaywrightIT does not declare any static, non-private, non-final, nested classes annotated with @Configuration.
2026-09-18T12:06:59.450Z INFO 2720100 --- [Pool-1-worker-3] t.c.s.AnnotationConfigContextLoaderUtils : Could not detect default configuration classes for test class [org.vaadin.addons.dramafinder.AbstractBasePlaywrightIT]: AbstractBasePlaywrightIT does not declare any static, non-private, non-final, nested classes annotated with @Configuration.
2026-09-18T12:06:59.453Z INFO 2720100 --- [Pool-1-worker-3] .b.t.c.SpringBootTestContextBootstrapper : Found @SpringBootConfiguration org.vaadin.addons.dramafinder.tests.TestServer for test class org.vaadin.addons.dramafinder.tests.it.TooltipViewIT
[INFO] Tests run: 1, Failures: 0, Errors: 0, Skipped: 0, Time elapsed: 2.325 s -- in org.vaadin.addons.dramafinder.tests.it.TabSheetViewIT
[INFO] Running org.vaadin.addons.dramafinder.tests.it.IntegerFieldGetByLabelIT
2026-09-18T12:06:59.780Z INFO 2720100 --- [Pool-1-worker-1] t.c.s.AnnotationConfigContextLoaderUtils : Could not detect default configuration classes for test class [org.vaadin.addons.dramafinder.tests.it.IntegerFieldGetByLabelIT]: IntegerFieldGetByLabelIT does not declare any static, non-private, non-final, nested classes annotated with @Configuration.
2026-09-18T12:06:59.784Z INFO 2720100 --- [Pool-1-worker-1] .b.t.c.SpringBootTestContextBootstrapper : Found @SpringBootConfiguration org.vaadin.addons.dramafinder.tests.TestServer for test class org.vaadin.addons.dramafinder.tests.it.IntegerFieldGetByLabelIT
2026-09-18T12:06:59.785Z INFO 2720100 --- [Pool-1-worker-1] t.c.s.AnnotationConfigContextLoaderUtils : Could not detect default configuration classes for test class [org.vaadin.addons.dramafinder.tests.it.IntegerFieldGetByLabelIT]: IntegerFieldGetByLabelIT does not declare any static, non-private, non-final, nested classes annotated with @Configuration.
2026-09-18T12:06:59.785Z INFO 2720100 --- [Pool-1-worker-1] t.c.s.AnnotationConfigContextLoaderUtils : Could not detect default configuration classes for test class [org.vaadin.addons.dramafinder.tests.it.SpringPlaywrightIT]: SpringPlaywrightIT does not declare any static, non-private, non-final, nested classes annotated with @Configuration.
2026-09-18T12:06:59.785Z INFO 2720100 --- [Pool-1-worker-1] t.c.s.AnnotationConfigContextLoaderUtils : Could not detect default configuration classes for test class [org.vaadin.addons.dramafinder.AbstractBasePlaywrightIT]: AbstractBasePlaywrightIT does not declare any static, non-private, non-final, nested classes annotated with @Configuration.
2026-09-18T12:06:59.786Z INFO 2720100 --- [Pool-1-worker-1] .b.t.c.SpringBootTestContextBootstrapper : Found @SpringBootConfiguration org.vaadin.addons.dramafinder.tests.TestServer for test class org.vaadin.addons.dramafinder.tests.it.IntegerFieldGetByLabelIT
[INFO] Tests run: 3, Failures: 0, Errors: 0, Skipped: 0, Time elapsed: 5.775 s -- in org.vaadin.addons.dramafinder.tests.it.IntegerFieldGetByLabelIT
[INFO] Running org.vaadin.addons.dramafinder.tests.it.SplitLayoutViewIT
2026-09-18T12:07:05.555Z INFO 2720100 --- [Pool-1-worker-1] t.c.s.AnnotationConfigContextLoaderUtils : Could not detect default configuration classes for test class [org.vaadin.addons.dramafinder.tests.it.SplitLayoutViewIT]: SplitLayoutViewIT does not declare any static, non-private, non-final, nested classes annotated with @Configuration.
2026-09-18T12:07:05.558Z INFO 2720100 --- [Pool-1-worker-1] .b.t.c.SpringBootTestContextBootstrapper : Found @SpringBootConfiguration org.vaadin.addons.dramafinder.tests.TestServer for test class org.vaadin.addons.dramafinder.tests.it.SplitLayoutViewIT
2026-09-18T12:07:05.563Z INFO 2720100 --- [Pool-1-worker-1] t.c.s.AnnotationConfigContextLoaderUtils : Could not detect default configuration classes for test class [org.vaadin.addons.dramafinder.tests.it.SplitLayoutViewIT]: SplitLayoutViewIT does not declare any static, non-private, non-final, nested classes annotated with @Configuration.
2026-09-18T12:07:05.566Z INFO 2720100 --- [Pool-1-worker-1] t.c.s.AnnotationConfigContextLoaderUtils : Could not detect default configuration classes for test class [org.vaadin.addons.dramafinder.tests.it.SpringPlaywrightIT]: SpringPlaywrightIT does not declare any static, non-private, non-final, nested classes annotated with @Configuration.
2026-09-18T12:07:05.566Z INFO 2720100 --- [Pool-1-worker-1] t.c.s.AnnotationConfigContextLoaderUtils : Could not detect default configuration classes for test class [org.vaadin.addons.dramafinder.AbstractBasePlaywrightIT]: AbstractBasePlaywrightIT does not declare any static, non-private, non-final, nested classes annotated with @Configuration.
2026-09-18T12:07:05.567Z INFO 2720100 --- [Pool-1-worker-1] .b.t.c.SpringBootTestContextBootstrapper : Found @SpringBootConfiguration org.vaadin.addons.dramafinder.tests.TestServer for test class org.vaadin.addons.dramafinder.tests.it.SplitLayoutViewIT
[INFO] Tests run: 4, Failures: 0, Errors: 0, Skipped: 0, Time elapsed: 10.28 s -- in org.vaadin.addons.dramafinder.tests.it.SplitLayoutViewIT
[INFO] Running org.vaadin.addons.dramafinder.tests.it.IntegerFieldViewIT
2026-09-18T12:07:15.846Z INFO 2720100 --- [Pool-1-worker-1] t.c.s.AnnotationConfigContextLoaderUtils : Could not detect default configuration classes for test class [org.vaadin.addons.dramafinder.tests.it.IntegerFieldViewIT]: IntegerFieldViewIT does not declare any static, non-private, non-final, nested classes annotated with @Configuration.
2026-09-18T12:07:15.847Z INFO 2720100 --- [Pool-1-worker-1] .b.t.c.SpringBootTestContextBootstrapper : Found @SpringBootConfiguration org.vaadin.addons.dramafinder.tests.TestServer for test class org.vaadin.addons.dramafinder.tests.it.IntegerFieldViewIT
2026-09-18T12:07:15.853Z INFO 2720100 --- [Pool-1-worker-1] t.c.s.AnnotationConfigContextLoaderUtils : Could not detect default configuration classes for test class [org.vaadin.addons.dramafinder.tests.it.IntegerFieldViewIT]: IntegerFieldViewIT does not declare any static, non-private, non-final, nested classes annotated with @Configuration.
2026-09-18T12:07:15.853Z INFO 2720100 --- [Pool-1-worker-1] t.c.s.AnnotationConfigContextLoaderUtils : Could not detect default configuration classes for test class [org.vaadin.addons.dramafinder.tests.it.SpringPlaywrightIT]: SpringPlaywrightIT does not declare any static, non-private, non-final, nested classes annotated with @Configuration.
2026-09-18T12:07:15.853Z INFO 2720100 --- [Pool-1-worker-1] t.c.s.AnnotationConfigContextLoaderUtils : Could not detect default configuration classes for test class [org.vaadin.addons.dramafinder.AbstractBasePlaywrightIT]: AbstractBasePlaywrightIT does not declare any static, non-private, non-final, nested classes annotated with @Configuration.
2026-09-18T12:07:15.854Z INFO 2720100 --- [Pool-1-worker-1] .b.t.c.SpringBootTestContextBootstrapper : Found @SpringBootConfiguration org.vaadin.addons.dramafinder.tests.TestServer for test class org.vaadin.addons.dramafinder.tests.it.IntegerFieldViewIT
[INFO] Tests run: 32, Failures: 0, Errors: 0, Skipped: 0, Time elapsed: 75.59 s -- in org.vaadin.addons.dramafinder.tests.it.MultiSelectComboBoxViewIT
[INFO] Running org.vaadin.addons.dramafinder.tests.it.ContextMenuViewIT
2026-09-18T12:07:19.975Z INFO 2720100 --- [Pool-1-worker-2] t.c.s.AnnotationConfigContextLoaderUtils : Could not detect default configuration classes for test class [org.vaadin.addons.dramafinder.tests.it.ContextMenuViewIT]: ContextMenuViewIT does not declare any static, non-private, non-final, nested classes annotated with @Configuration.
2026-09-18T12:07:19.982Z INFO 2720100 --- [Pool-1-worker-2] .b.t.c.SpringBootTestContextBootstrapper : Found @SpringBootConfiguration org.vaadin.addons.dramafinder.tests.TestServer for test class org.vaadin.addons.dramafinder.tests.it.ContextMenuViewIT
2026-09-18T12:07:19.983Z INFO 2720100 --- [Pool-1-worker-2] t.c.s.AnnotationConfigContextLoaderUtils : Could not detect default configuration classes for test class [org.vaadin.addons.dramafinder.tests.it.ContextMenuViewIT]: ContextMenuViewIT does not declare any static, non-private, non-final, nested classes annotated with @Configuration.
2026-09-18T12:07:19.989Z INFO 2720100 --- [Pool-1-worker-2] t.c.s.AnnotationConfigContextLoaderUtils : Could not detect default configuration classes for test class [org.vaadin.addons.dramafinder.tests.it.SpringPlaywrightIT]: SpringPlaywrightIT does not declare any static, non-private, non-final, nested classes annotated with @Configuration.
2026-09-18T12:07:19.989Z INFO 2720100 --- [Pool-1-worker-2] t.c.s.AnnotationConfigContextLoaderUtils : Could not detect default configuration classes for test class [org.vaadin.addons.dramafinder.AbstractBasePlaywrightIT]: AbstractBasePlaywrightIT does not declare any static, non-private, non-final, nested classes annotated with @Configuration.
2026-09-18T12:07:19.994Z INFO 2720100 --- [Pool-1-worker-2] .b.t.c.SpringBootTestContextBootstrapper : Found @SpringBootConfiguration org.vaadin.addons.dramafinder.tests.TestServer for test class org.vaadin.addons.dramafinder.tests.it.ContextMenuViewIT
[INFO] Tests run: 4, Failures: 0, Errors: 0, Skipped: 0, Time elapsed: 8.869 s -- in org.vaadin.addons.dramafinder.tests.it.IntegerFieldViewIT
[INFO] Running org.vaadin.addons.dramafinder.tests.it.DetailsViewIT
2026-09-18T12:07:24.713Z INFO 2720100 --- [Pool-1-worker-1] t.c.s.AnnotationConfigContextLoaderUtils : Could not detect default configuration classes for test class [org.vaadin.addons.dramafinder.tests.it.DetailsViewIT]: DetailsViewIT does not declare any static, non-private, non-final, nested classes annotated with @Configuration.
2026-09-18T12:07:24.734Z INFO 2720100 --- [Pool-1-worker-1] .b.t.c.SpringBootTestContextBootstrapper : Found @SpringBootConfiguration org.vaadin.addons.dramafinder.tests.TestServer for test class org.vaadin.addons.dramafinder.tests.it.DetailsViewIT
2026-09-18T12:07:24.744Z INFO 2720100 --- [Pool-1-worker-1] t.c.s.AnnotationConfigContextLoaderUtils : Could not detect default configuration classes for test class [org.vaadin.addons.dramafinder.tests.it.DetailsViewIT]: DetailsViewIT does not declare any static, non-private, non-final, nested classes annotated with @Configuration.
2026-09-18T12:07:24.745Z INFO 2720100 --- [Pool-1-worker-1] t.c.s.AnnotationConfigContextLoaderUtils : Could not detect default configuration classes for test class [org.vaadin.addons.dramafinder.tests.it.SpringPlaywrightIT]: SpringPlaywrightIT does not declare any static, non-private, non-final, nested classes annotated with @Configuration.
2026-09-18T12:07:24.745Z INFO 2720100 --- [Pool-1-worker-1] t.c.s.AnnotationConfigContextLoaderUtils : Could not detect default configuration classes for test class [org.vaadin.addons.dramafinder.AbstractBasePlaywrightIT]: AbstractBasePlaywrightIT does not declare any static, non-private, non-final, nested classes annotated with @Configuration.
2026-09-18T12:07:24.746Z INFO 2720100 --- [Pool-1-worker-1] .b.t.c.SpringBootTestContextBootstrapper : Found @SpringBootConfiguration org.vaadin.addons.dramafinder.tests.TestServer for test class org.vaadin.addons.dramafinder.tests.it.DetailsViewIT
[INFO] Tests run: 6, Failures: 0, Errors: 0, Skipped: 0, Time elapsed: 15.04 s -- in org.vaadin.addons.dramafinder.tests.it.ContextMenuViewIT
[INFO] Running org.vaadin.addons.dramafinder.tests.it.PopoverViewIT
2026-09-18T12:07:35.019Z INFO 2720100 --- [Pool-1-worker-2] t.c.s.AnnotationConfigContextLoaderUtils : Could not detect default configuration classes for test class [org.vaadin.addons.dramafinder.tests.it.PopoverViewIT]: PopoverViewIT does not declare any static, non-private, non-final, nested classes annotated with @Configuration.
2026-09-18T12:07:35.020Z INFO 2720100 --- [Pool-1-worker-2] .b.t.c.SpringBootTestContextBootstrapper : Found @SpringBootConfiguration org.vaadin.addons.dramafinder.tests.TestServer for test class org.vaadin.addons.dramafinder.tests.it.PopoverViewIT
2026-09-18T12:07:35.020Z INFO 2720100 --- [Pool-1-worker-2] t.c.s.AnnotationConfigContextLoaderUtils : Could not detect default configuration classes for test class [org.vaadin.addons.dramafinder.tests.it.PopoverViewIT]: PopoverViewIT does not declare any static, non-private, non-final, nested classes annotated with @Configuration.
2026-09-18T12:07:35.020Z INFO 2720100 --- [Pool-1-worker-2] t.c.s.AnnotationConfigContextLoaderUtils : Could not detect default configuration classes for test class [org.vaadin.addons.dramafinder.tests.it.SpringPlaywrightIT]: SpringPlaywrightIT does not declare any static, non-private, non-final, nested classes annotated with @Configuration.
2026-09-18T12:07:35.025Z INFO 2720100 --- [Pool-1-worker-2] t.c.s.AnnotationConfigContextLoaderUtils : Could not detect default configuration classes for test class [org.vaadin.addons.dramafinder.AbstractBasePlaywrightIT]: AbstractBasePlaywrightIT does not declare any static, non-private, non-final, nested classes annotated with @Configuration.
2026-09-18T12:07:35.026Z INFO 2720100 --- [Pool-1-worker-2] .b.t.c.SpringBootTestContextBootstrapper : Found @SpringBootConfiguration org.vaadin.addons.dramafinder.tests.TestServer for test class org.vaadin.addons.dramafinder.tests.it.PopoverViewIT
[INFO] Tests run: 7, Failures: 0, Errors: 0, Skipped: 0, Time elapsed: 15.63 s -- in org.vaadin.addons.dramafinder.tests.it.DetailsViewIT
[INFO] Running org.vaadin.addons.dramafinder.tests.it.BreadcrumbsViewIT
2026-09-18T12:07:40.375Z INFO 2720100 --- [Pool-1-worker-1] t.c.s.AnnotationConfigContextLoaderUtils : Could not detect default configuration classes for test class [org.vaadin.addons.dramafinder.tests.it.BreadcrumbsViewIT]: BreadcrumbsViewIT does not declare any static, non-private, non-final, nested classes annotated with @Configuration.
2026-09-18T12:07:40.379Z INFO 2720100 --- [Pool-1-worker-1] .b.t.c.SpringBootTestContextBootstrapper : Found @SpringBootConfiguration org.vaadin.addons.dramafinder.tests.TestServer for test class org.vaadin.addons.dramafinder.tests.it.BreadcrumbsViewIT
2026-09-18T12:07:40.384Z INFO 2720100 --- [Pool-1-worker-1] t.c.s.AnnotationConfigContextLoaderUtils : Could not detect default configuration classes for test class [org.vaadin.addons.dramafinder.tests.it.BreadcrumbsViewIT]: BreadcrumbsViewIT does not declare any static, non-private, non-final, nested classes annotated with @Configuration.
2026-09-18T12:07:40.384Z INFO 2720100 --- [Pool-1-worker-1] t.c.s.AnnotationConfigContextLoaderUtils : Could not detect default configuration classes for test class [org.vaadin.addons.dramafinder.tests.it.SpringPlaywrightIT]: SpringPlaywrightIT does not declare any static, non-private, non-final, nested classes annotated with @Configuration.
2026-09-18T12:07:40.385Z INFO 2720100 --- [Pool-1-worker-1] t.c.s.AnnotationConfigContextLoaderUtils : Could not detect default configuration classes for test class [org.vaadin.addons.dramafinder.AbstractBasePlaywrightIT]: AbstractBasePlaywrightIT does not declare any static, non-private, non-final, nested classes annotated with @Configuration.
2026-09-18T12:07:40.391Z INFO 2720100 --- [Pool-1-worker-1] .b.t.c.SpringBootTestContextBootstrapper : Found @SpringBootConfiguration org.vaadin.addons.dramafinder.tests.TestServer for test class org.vaadin.addons.dramafinder.tests.it.BreadcrumbsViewIT
[INFO] Tests run: 21, Failures: 0, Errors: 0, Skipped: 0, Time elapsed: 41.27 s -- in org.vaadin.addons.dramafinder.tests.it.TooltipViewIT
[INFO] Running org.vaadin.addons.dramafinder.tests.it.AppLayoutViewIT
2026-09-18T12:07:40.728Z INFO 2720100 --- [Pool-1-worker-3] t.c.s.AnnotationConfigContextLoaderUtils : Could not detect default configuration classes for test class [org.vaadin.addons.dramafinder.tests.it.AppLayoutViewIT]: AppLayoutViewIT does not declare any static, non-private, non-final, nested classes annotated with @Configuration.
2026-09-18T12:07:40.732Z INFO 2720100 --- [Pool-1-worker-3] .b.t.c.SpringBootTestContextBootstrapper : Found @SpringBootConfiguration org.vaadin.addons.dramafinder.tests.TestServer for test class org.vaadin.addons.dramafinder.tests.it.AppLayoutViewIT
2026-09-18T12:07:40.734Z INFO 2720100 --- [Pool-1-worker-3] t.c.s.AnnotationConfigContextLoaderUtils : Could not detect default configuration classes for test class [org.vaadin.addons.dramafinder.tests.it.AppLayoutViewIT]: AppLayoutViewIT does not declare any static, non-private, non-final, nested classes annotated with @Configuration.
2026-09-18T12:07:40.734Z INFO 2720100 --- [Pool-1-worker-3] t.c.s.AnnotationConfigContextLoaderUtils : Could not detect default configuration classes for test class [org.vaadin.addons.dramafinder.tests.it.SpringPlaywrightIT]: SpringPlaywrightIT does not declare any static, non-private, non-final, nested classes annotated with @Configuration.
2026-09-18T12:07:40.735Z INFO 2720100 --- [Pool-1-worker-3] t.c.s.AnnotationConfigContextLoaderUtils : Could not detect default configuration classes for test class [org.vaadin.addons.dramafinder.AbstractBasePlaywrightIT]: AbstractBasePlaywrightIT does not declare any static, non-private, non-final, nested classes annotated with @Configuration.
2026-09-18T12:07:40.736Z INFO 2720100 --- [Pool-1-worker-3] .b.t.c.SpringBootTestContextBootstrapper : Found @SpringBootConfiguration org.vaadin.addons.dramafinder.tests.TestServer for test class org.vaadin.addons.dramafinder.tests.it.AppLayoutViewIT
[INFO] Tests run: 5, Failures: 0, Errors: 0, Skipped: 0, Time elapsed: 10.91 s -- in org.vaadin.addons.dramafinder.tests.it.PopoverViewIT
[INFO] Running org.vaadin.addons.dramafinder.tests.it.MenuBarViewIT
2026-09-18T12:07:45.926Z INFO 2720100 --- [Pool-1-worker-2] t.c.s.AnnotationConfigContextLoaderUtils : Could not detect default configuration classes for test class [org.vaadin.addons.dramafinder.tests.it.MenuBarViewIT]: MenuBarViewIT does not declare any static, non-private, non-final, nested classes annotated with @Configuration.
2026-09-18T12:07:45.934Z INFO 2720100 --- [Pool-1-worker-2] .b.t.c.SpringBootTestContextBootstrapper : Found @SpringBootConfiguration org.vaadin.addons.dramafinder.tests.TestServer for test class org.vaadin.addons.dramafinder.tests.it.MenuBarViewIT
2026-09-18T12:07:45.935Z INFO 2720100 --- [Pool-1-worker-2] t.c.s.AnnotationConfigContextLoaderUtils : Could not detect default configuration classes for test class [org.vaadin.addons.dramafinder.tests.it.MenuBarViewIT]: MenuBarViewIT does not declare any static, non-private, non-final, nested classes annotated with @Configuration.
2026-09-18T12:07:45.938Z INFO 2720100 --- [Pool-1-worker-2] t.c.s.AnnotationConfigContextLoaderUtils : Could not detect default configuration classes for test class [org.vaadin.addons.dramafinder.tests.it.SpringPlaywrightIT]: SpringPlaywrightIT does not declare any static, non-private, non-final, nested classes annotated with @Configuration.
2026-09-18T12:07:45.938Z INFO 2720100 --- [Pool-1-worker-2] t.c.s.AnnotationConfigContextLoaderUtils : Could not detect default configuration classes for test class [org.vaadin.addons.dramafinder.AbstractBasePlaywrightIT]: AbstractBasePlaywrightIT does not declare any static, non-private, non-final, nested classes annotated with @Configuration.
2026-09-18T12:07:45.939Z INFO 2720100 --- [Pool-1-worker-2] .b.t.c.SpringBootTestContextBootstrapper : Found @SpringBootConfiguration org.vaadin.addons.dramafinder.tests.TestServer for test class org.vaadin.addons.dramafinder.tests.it.MenuBarViewIT
2026-09-18T12:07:47.809Z WARN 2720100 --- [-auto-1-exec-13] com.vaadin.flow.dom.impl.ThemeListImpl : Theme name 'badge success' contains spaces and was added as the separate theme names [badge, success]. Add one theme name per add() call, use HasTheme.addThemeNames(String...), or use Element.setAttribute("theme", ...) to set a space separated value. Only add() splits such a value, so contains(), remove() and the other operations will not match it, and support for it may be removed in a future version.
[INFO] Tests run: 4, Failures: 0, Errors: 0, Skipped: 0, Time elapsed: 8.125 s -- in org.vaadin.addons.dramafinder.tests.it.MenuBarViewIT
[INFO] Running org.vaadin.addons.dramafinder.tests.it.MultiSelectComboBoxGetByLabelIT
2026-09-18T12:07:54.054Z INFO 2720100 --- [Pool-1-worker-2] t.c.s.AnnotationConfigContextLoaderUtils : Could not detect default configuration classes for test class [org.vaadin.addons.dramafinder.tests.it.MultiSelectComboBoxGetByLabelIT]: MultiSelectComboBoxGetByLabelIT does not declare any static, non-private, non-final, nested classes annotated with @Configuration.
2026-09-18T12:07:54.061Z INFO 2720100 --- [Pool-1-worker-2] .b.t.c.SpringBootTestContextBootstrapper : Found @SpringBootConfiguration org.vaadin.addons.dramafinder.tests.TestServer for test class org.vaadin.addons.dramafinder.tests.it.MultiSelectComboBoxGetByLabelIT
2026-09-18T12:07:54.066Z INFO 2720100 --- [Pool-1-worker-2] t.c.s.AnnotationConfigContextLoaderUtils : Could not detect default configuration classes for test class [org.vaadin.addons.dramafinder.tests.it.MultiSelectComboBoxGetByLabelIT]: MultiSelectComboBoxGetByLabelIT does not declare any static, non-private, non-final, nested classes annotated with @Configuration.
2026-09-18T12:07:54.066Z INFO 2720100 --- [Pool-1-worker-2] t.c.s.AnnotationConfigContextLoaderUtils : Could not detect default configuration classes for test class [org.vaadin.addons.dramafinder.tests.it.SpringPlaywrightIT]: SpringPlaywrightIT does not declare any static, non-private, non-final, nested classes annotated with @Configuration.
2026-09-18T12:07:54.067Z INFO 2720100 --- [Pool-1-worker-2] t.c.s.AnnotationConfigContextLoaderUtils : Could not detect default configuration classes for test class [org.vaadin.addons.dramafinder.AbstractBasePlaywrightIT]: AbstractBasePlaywrightIT does not declare any static, non-private, non-final, nested classes annotated with @Configuration.
2026-09-18T12:07:54.069Z INFO 2720100 --- [Pool-1-worker-2] .b.t.c.SpringBootTestContextBootstrapper : Found @SpringBootConfiguration org.vaadin.addons.dramafinder.tests.TestServer for test class org.vaadin.addons.dramafinder.tests.it.MultiSelectComboBoxGetByLabelIT
[INFO] Tests run: 3, Failures: 0, Errors: 0, Skipped: 0, Time elapsed: 5.576 s -- in org.vaadin.addons.dramafinder.tests.it.MultiSelectComboBoxGetByLabelIT
[INFO] Running org.vaadin.addons.dramafinder.tests.it.MessageListViewIT
2026-09-18T12:07:59.636Z INFO 2720100 --- [Pool-1-worker-2] t.c.s.AnnotationConfigContextLoaderUtils : Could not detect default configuration classes for test class [org.vaadin.addons.dramafinder.tests.it.MessageListViewIT]: MessageListViewIT does not declare any static, non-private, non-final, nested classes annotated with @Configuration.
2026-09-18T12:07:59.639Z INFO 2720100 --- [Pool-1-worker-2] .b.t.c.SpringBootTestContextBootstrapper : Found @SpringBootConfiguration org.vaadin.addons.dramafinder.tests.TestServer for test class org.vaadin.addons.dramafinder.tests.it.MessageListViewIT
2026-09-18T12:07:59.640Z INFO 2720100 --- [Pool-1-worker-2] t.c.s.AnnotationConfigContextLoaderUtils : Could not detect default configuration classes for test class [org.vaadin.addons.dramafinder.tests.it.MessageListViewIT]: MessageListViewIT does not declare any static, non-private, non-final, nested classes annotated with @Configuration.
2026-09-18T12:07:59.641Z INFO 2720100 --- [Pool-1-worker-2] t.c.s.AnnotationConfigContextLoaderUtils : Could not detect default configuration classes for test class [org.vaadin.addons.dramafinder.tests.it.SpringPlaywrightIT]: SpringPlaywrightIT does not declare any static, non-private, non-final, nested classes annotated with @Configuration.
2026-09-18T12:07:59.641Z INFO 2720100 --- [Pool-1-worker-2] t.c.s.AnnotationConfigContextLoaderUtils : Could not detect default configuration classes for test class [org.vaadin.addons.dramafinder.AbstractBasePlaywrightIT]: AbstractBasePlaywrightIT does not declare any static, non-private, non-final, nested classes annotated with @Configuration.
2026-09-18T12:07:59.642Z INFO 2720100 --- [Pool-1-worker-2] .b.t.c.SpringBootTestContextBootstrapper : Found @SpringBootConfiguration org.vaadin.addons.dramafinder.tests.TestServer for test class org.vaadin.addons.dramafinder.tests.it.MessageListViewIT
[INFO] Tests run: 12, Failures: 0, Errors: 0, Skipped: 0, Time elapsed: 22.22 s -- in org.vaadin.addons.dramafinder.tests.it.BreadcrumbsViewIT
[INFO] Running org.vaadin.addons.dramafinder.tests.it.EmailFieldViewIT
2026-09-18T12:08:02.595Z INFO 2720100 --- [Pool-1-worker-1] t.c.s.AnnotationConfigContextLoaderUtils : Could not detect default configuration classes for test class [org.vaadin.addons.dramafinder.tests.it.EmailFieldViewIT]: EmailFieldViewIT does not declare any static, non-private, non-final, nested classes annotated with @Configuration.
2026-09-18T12:08:02.599Z INFO 2720100 --- [Pool-1-worker-1] .b.t.c.SpringBootTestContextBootstrapper : Found @SpringBootConfiguration org.vaadin.addons.dramafinder.tests.TestServer for test class org.vaadin.addons.dramafinder.tests.it.EmailFieldViewIT
2026-09-18T12:08:02.600Z INFO 2720100 --- [Pool-1-worker-1] t.c.s.AnnotationConfigContextLoaderUtils : Could not detect default configuration classes for test class [org.vaadin.addons.dramafinder.tests.it.EmailFieldViewIT]: EmailFieldViewIT does not declare any static, non-private, non-final, nested classes annotated with @Configuration.
2026-09-18T12:08:02.600Z INFO 2720100 --- [Pool-1-worker-1] t.c.s.AnnotationConfigContextLoaderUtils : Could not detect default configuration classes for test class [org.vaadin.addons.dramafinder.tests.it.SpringPlaywrightIT]: SpringPlaywrightIT does not declare any static, non-private, non-final, nested classes annotated with @Configuration.
2026-09-18T12:08:02.600Z INFO 2720100 --- [Pool-1-worker-1] t.c.s.AnnotationConfigContextLoaderUtils : Could not detect default configuration classes for test class [org.vaadin.addons.dramafinder.AbstractBasePlaywrightIT]: AbstractBasePlaywrightIT does not declare any static, non-private, non-final, nested classes annotated with @Configuration.
2026-09-18T12:08:02.602Z INFO 2720100 --- [Pool-1-worker-1] .b.t.c.SpringBootTestContextBootstrapper : Found @SpringBootConfiguration org.vaadin.addons.dramafinder.tests.TestServer for test class org.vaadin.addons.dramafinder.tests.it.EmailFieldViewIT
[INFO] Tests run: 4, Failures: 0, Errors: 0, Skipped: 0, Time elapsed: 8.374 s -- in org.vaadin.addons.dramafinder.tests.it.MessageListViewIT
[INFO] Running org.vaadin.addons.dramafinder.tests.it.GridSelectionViewIT
2026-09-18T12:08:08.007Z INFO 2720100 --- [Pool-1-worker-2] t.c.s.AnnotationConfigContextLoaderUtils : Could not detect default configuration classes for test class [org.vaadin.addons.dramafinder.tests.it.GridSelectionViewIT]: GridSelectionViewIT does not declare any static, non-private, non-final, nested classes annotated with @Configuration.
2026-09-18T12:08:08.008Z INFO 2720100 --- [Pool-1-worker-2] .b.t.c.SpringBootTestContextBootstrapper : Found @SpringBootConfiguration org.vaadin.addons.dramafinder.tests.TestServer for test class org.vaadin.addons.dramafinder.tests.it.GridSelectionViewIT
2026-09-18T12:08:08.009Z INFO 2720100 --- [Pool-1-worker-2] t.c.s.AnnotationConfigContextLoaderUtils : Could not detect default configuration classes for test class [org.vaadin.addons.dramafinder.tests.it.GridSelectionViewIT]: GridSelectionViewIT does not declare any static, non-private, non-final, nested classes annotated with @Configuration.
2026-09-18T12:08:08.009Z INFO 2720100 --- [Pool-1-worker-2] t.c.s.AnnotationConfigContextLoaderUtils : Could not detect default configuration classes for test class [org.vaadin.addons.dramafinder.tests.it.SpringPlaywrightIT]: SpringPlaywrightIT does not declare any static, non-private, non-final, nested classes annotated with @Configuration.
2026-09-18T12:08:08.009Z INFO 2720100 --- [Pool-1-worker-2] t.c.s.AnnotationConfigContextLoaderUtils : Could not detect default configuration classes for test class [org.vaadin.addons.dramafinder.AbstractBasePlaywrightIT]: AbstractBasePlaywrightIT does not declare any static, non-private, non-final, nested classes annotated with @Configuration.
2026-09-18T12:08:08.011Z INFO 2720100 --- [Pool-1-worker-2] .b.t.c.SpringBootTestContextBootstrapper : Found @SpringBootConfiguration org.vaadin.addons.dramafinder.tests.TestServer for test class org.vaadin.addons.dramafinder.tests.it.GridSelectionViewIT
[INFO] Tests run: 3, Failures: 0, Errors: 0, Skipped: 0, Time elapsed: 6.901 s -- in org.vaadin.addons.dramafinder.tests.it.EmailFieldViewIT
[INFO] Running org.vaadin.addons.dramafinder.tests.it.NumberFieldGetByLabelIT
2026-09-18T12:08:09.489Z INFO 2720100 --- [Pool-1-worker-1] t.c.s.AnnotationConfigContextLoaderUtils : Could not detect default configuration classes for test class [org.vaadin.addons.dramafinder.tests.it.NumberFieldGetByLabelIT]: NumberFieldGetByLabelIT does not declare any static, non-private, non-final, nested classes annotated with @Configuration.
2026-09-18T12:08:09.492Z INFO 2720100 --- [Pool-1-worker-1] .b.t.c.SpringBootTestContextBootstrapper : Found @SpringBootConfiguration org.vaadin.addons.dramafinder.tests.TestServer for test class org.vaadin.addons.dramafinder.tests.it.NumberFieldGetByLabelIT
2026-09-18T12:08:09.494Z INFO 2720100 --- [Pool-1-worker-1] t.c.s.AnnotationConfigContextLoaderUtils : Could not detect default configuration classes for test class [org.vaadin.addons.dramafinder.tests.it.NumberFieldGetByLabelIT]: NumberFieldGetByLabelIT does not declare any static, non-private, non-final, nested classes annotated with @Configuration.
2026-09-18T12:08:09.494Z INFO 2720100 --- [Pool-1-worker-1] t.c.s.AnnotationConfigContextLoaderUtils : Could not detect default configuration classes for test class [org.vaadin.addons.dramafinder.tests.it.SpringPlaywrightIT]: SpringPlaywrightIT does not declare any static, non-private, non-final, nested classes annotated with @Configuration.
2026-09-18T12:08:09.495Z INFO 2720100 --- [Pool-1-worker-1] t.c.s.AnnotationConfigContextLoaderUtils : Could not detect default configuration classes for test class [org.vaadin.addons.dramafinder.AbstractBasePlaywrightIT]: AbstractBasePlaywrightIT does not declare any static, non-private, non-final, nested classes annotated with @Configuration.
2026-09-18T12:08:09.495Z INFO 2720100 --- [Pool-1-worker-1] .b.t.c.SpringBootTestContextBootstrapper : Found @SpringBootConfiguration org.vaadin.addons.dramafinder.tests.TestServer for test class org.vaadin.addons.dramafinder.tests.it.NumberFieldGetByLabelIT
[INFO] Tests run: 3, Failures: 0, Errors: 0, Skipped: 0, Time elapsed: 5.808 s -- in org.vaadin.addons.dramafinder.tests.it.NumberFieldGetByLabelIT
[INFO] Running org.vaadin.addons.dramafinder.tests.it.DatePickerViewIT
2026-09-18T12:08:15.301Z INFO 2720100 --- [Pool-1-worker-1] t.c.s.AnnotationConfigContextLoaderUtils : Could not detect default configuration classes for test class [org.vaadin.addons.dramafinder.tests.it.DatePickerViewIT]: DatePickerViewIT does not declare any static, non-private, non-final, nested classes annotated with @Configuration.
2026-09-18T12:08:15.302Z INFO 2720100 --- [Pool-1-worker-1] .b.t.c.SpringBootTestContextBootstrapper : Found @SpringBootConfiguration org.vaadin.addons.dramafinder.tests.TestServer for test class org.vaadin.addons.dramafinder.tests.it.DatePickerViewIT
2026-09-18T12:08:15.303Z INFO 2720100 --- [Pool-1-worker-1] t.c.s.AnnotationConfigContextLoaderUtils : Could not detect default configuration classes for test class [org.vaadin.addons.dramafinder.tests.it.DatePickerViewIT]: DatePickerViewIT does not declare any static, non-private, non-final, nested classes annotated with @Configuration.
2026-09-18T12:08:15.303Z INFO 2720100 --- [Pool-1-worker-1] t.c.s.AnnotationConfigContextLoaderUtils : Could not detect default configuration classes for test class [org.vaadin.addons.dramafinder.tests.it.SpringPlaywrightIT]: SpringPlaywrightIT does not declare any static, non-private, non-final, nested classes annotated with @Configuration.
2026-09-18T12:08:15.303Z INFO 2720100 --- [Pool-1-worker-1] t.c.s.AnnotationConfigContextLoaderUtils : Could not detect default configuration classes for test class [org.vaadin.addons.dramafinder.AbstractBasePlaywrightIT]: AbstractBasePlaywrightIT does not declare any static, non-private, non-final, nested classes annotated with @Configuration.
2026-09-18T12:08:15.307Z INFO 2720100 --- [Pool-1-worker-1] .b.t.c.SpringBootTestContextBootstrapper : Found @SpringBootConfiguration org.vaadin.addons.dramafinder.tests.TestServer for test class org.vaadin.addons.dramafinder.tests.it.DatePickerViewIT
[INFO] Tests run: 22, Failures: 0, Errors: 0, Skipped: 0, Time elapsed: 40.11 s -- in org.vaadin.addons.dramafinder.tests.it.AppLayoutViewIT
[INFO] Running org.vaadin.addons.dramafinder.tests.it.PasswordFieldViewIT
2026-09-18T12:08:20.841Z INFO 2720100 --- [Pool-1-worker-3] t.c.s.AnnotationConfigContextLoaderUtils : Could not detect default configuration classes for test class [org.vaadin.addons.dramafinder.tests.it.PasswordFieldViewIT]: PasswordFieldViewIT does not declare any static, non-private, non-final, nested classes annotated with @Configuration.
2026-09-18T12:08:20.846Z INFO 2720100 --- [Pool-1-worker-3] .b.t.c.SpringBootTestContextBootstrapper : Found @SpringBootConfiguration org.vaadin.addons.dramafinder.tests.TestServer for test class org.vaadin.addons.dramafinder.tests.it.PasswordFieldViewIT
2026-09-18T12:08:20.847Z INFO 2720100 --- [Pool-1-worker-3] t.c.s.AnnotationConfigContextLoaderUtils : Could not detect default configuration classes for test class [org.vaadin.addons.dramafinder.tests.it.PasswordFieldViewIT]: PasswordFieldViewIT does not declare any static, non-private, non-final, nested classes annotated with @Configuration.
2026-09-18T12:08:20.847Z INFO 2720100 --- [Pool-1-worker-3] t.c.s.AnnotationConfigContextLoaderUtils : Could not detect default configuration classes for test class [org.vaadin.addons.dramafinder.tests.it.SpringPlaywrightIT]: SpringPlaywrightIT does not declare any static, non-private, non-final, nested classes annotated with @Configuration.
2026-09-18T12:08:20.849Z INFO 2720100 --- [Pool-1-worker-3] t.c.s.AnnotationConfigContextLoaderUtils : Could not detect default configuration classes for test class [org.vaadin.addons.dramafinder.AbstractBasePlaywrightIT]: AbstractBasePlaywrightIT does not declare any static, non-private, non-final, nested classes annotated with @Configuration.
2026-09-18T12:08:20.849Z INFO 2720100 --- [Pool-1-worker-3] .b.t.c.SpringBootTestContextBootstrapper : Found @SpringBootConfiguration org.vaadin.addons.dramafinder.tests.TestServer for test class org.vaadin.addons.dramafinder.tests.it.PasswordFieldViewIT
[INFO] Tests run: 8, Failures: 0, Errors: 0, Skipped: 0, Time elapsed: 22.53 s -- in org.vaadin.addons.dramafinder.tests.it.GridSelectionViewIT
[INFO] Running org.vaadin.addons.dramafinder.tests.it.TextAreaGetByLabelIT
2026-09-18T12:08:30.542Z INFO 2720100 --- [Pool-1-worker-2] t.c.s.AnnotationConfigContextLoaderUtils : Could not detect default configuration classes for test class [org.vaadin.addons.dramafinder.tests.it.TextAreaGetByLabelIT]: TextAreaGetByLabelIT does not declare any static, non-private, non-final, nested classes annotated with @Configuration.
2026-09-18T12:08:30.546Z INFO 2720100 --- [Pool-1-worker-2] .b.t.c.SpringBootTestContextBootstrapper : Found @SpringBootConfiguration org.vaadin.addons.dramafinder.tests.TestServer for test class org.vaadin.addons.dramafinder.tests.it.TextAreaGetByLabelIT
2026-09-18T12:08:30.547Z INFO 2720100 --- [Pool-1-worker-2] t.c.s.AnnotationConfigContextLoaderUtils : Could not detect default configuration classes for test class [org.vaadin.addons.dramafinder.tests.it.TextAreaGetByLabelIT]: TextAreaGetByLabelIT does not declare any static, non-private, non-final, nested classes annotated with @Configuration.
2026-09-18T12:08:30.547Z INFO 2720100 --- [Pool-1-worker-2] t.c.s.AnnotationConfigContextLoaderUtils : Could not detect default configuration classes for test class [org.vaadin.addons.dramafinder.tests.it.SpringPlaywrightIT]: SpringPlaywrightIT does not declare any static, non-private, non-final, nested classes annotated with @Configuration.
2026-09-18T12:08:30.547Z INFO 2720100 --- [Pool-1-worker-2] t.c.s.AnnotationConfigContextLoaderUtils : Could not detect default configuration classes for test class [org.vaadin.addons.dramafinder.AbstractBasePlaywrightIT]: AbstractBasePlaywrightIT does not declare any static, non-private, non-final, nested classes annotated with @Configuration.
2026-09-18T12:08:30.549Z INFO 2720100 --- [Pool-1-worker-2] .b.t.c.SpringBootTestContextBootstrapper : Found @SpringBootConfiguration org.vaadin.addons.dramafinder.tests.TestServer for test class org.vaadin.addons.dramafinder.tests.it.TextAreaGetByLabelIT
[INFO] Tests run: 8, Failures: 0, Errors: 0, Skipped: 0, Time elapsed: 16.28 s -- in org.vaadin.addons.dramafinder.tests.it.DatePickerViewIT
[INFO] Running org.vaadin.addons.dramafinder.tests.it.ComboBoxViewIT
2026-09-18T12:08:31.580Z INFO 2720100 --- [Pool-1-worker-1] t.c.s.AnnotationConfigContextLoaderUtils : Could not detect default configuration classes for test class [org.vaadin.addons.dramafinder.tests.it.ComboBoxViewIT]: ComboBoxViewIT does not declare any static, non-private, non-final, nested classes annotated with @Configuration.
2026-09-18T12:08:31.585Z INFO 2720100 --- [Pool-1-worker-1] .b.t.c.SpringBootTestContextBootstrapper : Found @SpringBootConfiguration org.vaadin.addons.dramafinder.tests.TestServer for test class org.vaadin.addons.dramafinder.tests.it.ComboBoxViewIT
2026-09-18T12:08:31.586Z INFO 2720100 --- [Pool-1-worker-1] t.c.s.AnnotationConfigContextLoaderUtils : Could not detect default configuration classes for test class [org.vaadin.addons.dramafinder.tests.it.ComboBoxViewIT]: ComboBoxViewIT does not declare any static, non-private, non-final, nested classes annotated with @Configuration.
2026-09-18T12:08:31.586Z INFO 2720100 --- [Pool-1-worker-1] t.c.s.AnnotationConfigContextLoaderUtils : Could not detect default configuration classes for test class [org.vaadin.addons.dramafinder.tests.it.SpringPlaywrightIT]: SpringPlaywrightIT does not declare any static, non-private, non-final, nested classes annotated with @Configuration.
2026-09-18T12:08:31.586Z INFO 2720100 --- [Pool-1-worker-1] t.c.s.AnnotationConfigContextLoaderUtils : Could not detect default configuration classes for test class [org.vaadin.addons.dramafinder.AbstractBasePlaywrightIT]: AbstractBasePlaywrightIT does not declare any static, non-private, non-final, nested classes annotated with @Configuration.
2026-09-18T12:08:31.587Z INFO 2720100 --- [Pool-1-worker-1] .b.t.c.SpringBootTestContextBootstrapper : Found @SpringBootConfiguration org.vaadin.addons.dramafinder.tests.TestServer for test class org.vaadin.addons.dramafinder.tests.it.ComboBoxViewIT
[INFO] Tests run: 2, Failures: 0, Errors: 0, Skipped: 0, Time elapsed: 4.014 s -- in org.vaadin.addons.dramafinder.tests.it.TextAreaGetByLabelIT
[INFO] Running org.vaadin.addons.dramafinder.tests.it.SelectViewIT
2026-09-18T12:08:34.561Z INFO 2720100 --- [Pool-1-worker-2] t.c.s.AnnotationConfigContextLoaderUtils : Could not detect default configuration classes for test class [org.vaadin.addons.dramafinder.tests.it.SelectViewIT]: SelectViewIT does not declare any static, non-private, non-final, nested classes annotated with @Configuration.
2026-09-18T12:08:34.564Z INFO 2720100 --- [Pool-1-worker-2] .b.t.c.SpringBootTestContextBootstrapper : Found @SpringBootConfiguration org.vaadin.addons.dramafinder.tests.TestServer for test class org.vaadin.addons.dramafinder.tests.it.SelectViewIT
2026-09-18T12:08:34.565Z INFO 2720100 --- [Pool-1-worker-2] t.c.s.AnnotationConfigContextLoaderUtils : Could not detect default configuration classes for test class [org.vaadin.addons.dramafinder.tests.it.SelectViewIT]: SelectViewIT does not declare any static, non-private, non-final, nested classes annotated with @Configuration.
2026-09-18T12:08:34.568Z INFO 2720100 --- [Pool-1-worker-2] t.c.s.AnnotationConfigContextLoaderUtils : Could not detect default configuration classes for test class [org.vaadin.addons.dramafinder.tests.it.SpringPlaywrightIT]: SpringPlaywrightIT does not declare any static, non-private, non-final, nested classes annotated with @Configuration.
2026-09-18T12:08:34.569Z INFO 2720100 --- [Pool-1-worker-2] t.c.s.AnnotationConfigContextLoaderUtils : Could not detect default configuration classes for test class [org.vaadin.addons.dramafinder.AbstractBasePlaywrightIT]: AbstractBasePlaywrightIT does not declare any static, non-private, non-final, nested classes annotated with @Configuration.
2026-09-18T12:08:34.571Z INFO 2720100 --- [Pool-1-worker-2] .b.t.c.SpringBootTestContextBootstrapper : Found @SpringBootConfiguration org.vaadin.addons.dramafinder.tests.TestServer for test class org.vaadin.addons.dramafinder.tests.it.SelectViewIT
[INFO] Tests run: 23, Failures: 0, Errors: 0, Skipped: 0, Time elapsed: 42.40 s -- in org.vaadin.addons.dramafinder.tests.it.PasswordFieldViewIT
[INFO] Running org.vaadin.addons.dramafinder.tests.it.BigDecimalFieldViewIT
2026-09-18T12:09:03.248Z INFO 2720100 --- [Pool-1-worker-3] t.c.s.AnnotationConfigContextLoaderUtils : Could not detect default configuration classes for test class [org.vaadin.addons.dramafinder.tests.it.BigDecimalFieldViewIT]: BigDecimalFieldViewIT does not declare any static, non-private, non-final, nested classes annotated with @Configuration.
2026-09-18T12:09:03.252Z INFO 2720100 --- [Pool-1-worker-3] .b.t.c.SpringBootTestContextBootstrapper : Found @SpringBootConfiguration org.vaadin.addons.dramafinder.tests.TestServer for test class org.vaadin.addons.dramafinder.tests.it.BigDecimalFieldViewIT
2026-09-18T12:09:03.253Z INFO 2720100 --- [Pool-1-worker-3] t.c.s.AnnotationConfigContextLoaderUtils : Could not detect default configuration classes for test class [org.vaadin.addons.dramafinder.tests.it.BigDecimalFieldViewIT]: BigDecimalFieldViewIT does not declare any static, non-private, non-final, nested classes annotated with @Configuration.
2026-09-18T12:09:03.254Z INFO 2720100 --- [Pool-1-worker-3] t.c.s.AnnotationConfigContextLoaderUtils : Could not detect default configuration classes for test class [org.vaadin.addons.dramafinder.tests.it.SpringPlaywrightIT]: SpringPlaywrightIT does not declare any static, non-private, non-final, nested classes annotated with @Configuration.
2026-09-18T12:09:03.255Z INFO 2720100 --- [Pool-1-worker-3] t.c.s.AnnotationConfigContextLoaderUtils : Could not detect default configuration classes for test class [org.vaadin.addons.dramafinder.AbstractBasePlaywrightIT]: AbstractBasePlaywrightIT does not declare any static, non-private, non-final, nested classes annotated with @Configuration.
2026-09-18T12:09:03.262Z INFO 2720100 --- [Pool-1-worker-3] .b.t.c.SpringBootTestContextBootstrapper : Found @SpringBootConfiguration org.vaadin.addons.dramafinder.tests.TestServer for test class org.vaadin.addons.dramafinder.tests.it.BigDecimalFieldViewIT
[INFO] Tests run: 16, Failures: 0, Errors: 0, Skipped: 0, Time elapsed: 29.54 s -- in org.vaadin.addons.dramafinder.tests.it.SelectViewIT
[INFO] Running org.vaadin.addons.dramafinder.tests.it.TreeGridMultiSelectViewIT
2026-09-18T12:09:04.102Z INFO 2720100 --- [Pool-1-worker-2] t.c.s.AnnotationConfigContextLoaderUtils : Could not detect default configuration classes for test class [org.vaadin.addons.dramafinder.tests.it.TreeGridMultiSelectViewIT]: TreeGridMultiSelectViewIT does not declare any static, non-private, non-final, nested classes annotated with @Configuration.
2026-09-18T12:09:04.103Z INFO 2720100 --- [Pool-1-worker-2] .b.t.c.SpringBootTestContextBootstrapper : Found @SpringBootConfiguration org.vaadin.addons.dramafinder.tests.TestServer for test class org.vaadin.addons.dramafinder.tests.it.TreeGridMultiSelectViewIT
2026-09-18T12:09:04.107Z INFO 2720100 --- [Pool-1-worker-2] t.c.s.AnnotationConfigContextLoaderUtils : Could not detect default configuration classes for test class [org.vaadin.addons.dramafinder.tests.it.TreeGridMultiSelectViewIT]: TreeGridMultiSelectViewIT does not declare any static, non-private, non-final, nested classes annotated with @Configuration.
2026-09-18T12:09:04.107Z INFO 2720100 --- [Pool-1-worker-2] t.c.s.AnnotationConfigContextLoaderUtils : Could not detect default configuration classes for test class [org.vaadin.addons.dramafinder.tests.it.SpringPlaywrightIT]: SpringPlaywrightIT does not declare any static, non-private, non-final, nested classes annotated with @Configuration.
2026-09-18T12:09:04.107Z INFO 2720100 --- [Pool-1-worker-2] t.c.s.AnnotationConfigContextLoaderUtils : Could not detect default configuration classes for test class [org.vaadin.addons.dramafinder.AbstractBasePlaywrightIT]: AbstractBasePlaywrightIT does not declare any static, non-private, non-final, nested classes annotated with @Configuration.
2026-09-18T12:09:04.108Z INFO 2720100 --- [Pool-1-worker-2] .b.t.c.SpringBootTestContextBootstrapper : Found @SpringBootConfiguration org.vaadin.addons.dramafinder.tests.TestServer for test class org.vaadin.addons.dramafinder.tests.it.TreeGridMultiSelectViewIT
[INFO] Tests run: 2, Failures: 0, Errors: 0, Skipped: 0, Time elapsed: 3.744 s -- in org.vaadin.addons.dramafinder.tests.it.BigDecimalFieldViewIT
[INFO] Running org.vaadin.addons.dramafinder.tests.it.RadioButtonGroupViewIT
2026-09-18T12:09:06.998Z INFO 2720100 --- [Pool-1-worker-3] t.c.s.AnnotationConfigContextLoaderUtils : Could not detect default configuration classes for test class [org.vaadin.addons.dramafinder.tests.it.RadioButtonGroupViewIT]: RadioButtonGroupViewIT does not declare any static, non-private, non-final, nested classes annotated with @Configuration.
2026-09-18T12:09:06.999Z INFO 2720100 --- [Pool-1-worker-3] .b.t.c.SpringBootTestContextBootstrapper : Found @SpringBootConfiguration org.vaadin.addons.dramafinder.tests.TestServer for test class org.vaadin.addons.dramafinder.tests.it.RadioButtonGroupViewIT
2026-09-18T12:09:07.002Z INFO 2720100 --- [Pool-1-worker-3] t.c.s.AnnotationConfigContextLoaderUtils : Could not detect default configuration classes for test class [org.vaadin.addons.dramafinder.tests.it.RadioButtonGroupViewIT]: RadioButtonGroupViewIT does not declare any static, non-private, non-final, nested classes annotated with @Configuration.
2026-09-18T12:09:07.002Z INFO 2720100 --- [Pool-1-worker-3] t.c.s.AnnotationConfigContextLoaderUtils : Could not detect default configuration classes for test class [org.vaadin.addons.dramafinder.tests.it.SpringPlaywrightIT]: SpringPlaywrightIT does not declare any static, non-private, non-final, nested classes annotated with @Configuration.
2026-09-18T12:09:07.003Z INFO 2720100 --- [Pool-1-worker-3] t.c.s.AnnotationConfigContextLoaderUtils : Could not detect default configuration classes for test class [org.vaadin.addons.dramafinder.AbstractBasePlaywrightIT]: AbstractBasePlaywrightIT does not declare any static, non-private, non-final, nested classes annotated with @Configuration.
2026-09-18T12:09:07.003Z INFO 2720100 --- [Pool-1-worker-3] .b.t.c.SpringBootTestContextBootstrapper : Found @SpringBootConfiguration org.vaadin.addons.dramafinder.tests.TestServer for test class org.vaadin.addons.dramafinder.tests.it.RadioButtonGroupViewIT
[INFO] Tests run: 5, Failures: 0, Errors: 0, Skipped: 0, Time elapsed: 8.204 s -- in org.vaadin.addons.dramafinder.tests.it.RadioButtonGroupViewIT
[INFO] Running org.vaadin.addons.dramafinder.tests.it.ButtonViewIT
2026-09-18T12:09:15.203Z INFO 2720100 --- [Pool-1-worker-3] t.c.s.AnnotationConfigContextLoaderUtils : Could not detect default configuration classes for test class [org.vaadin.addons.dramafinder.tests.it.ButtonViewIT]: ButtonViewIT does not declare any static, non-private, non-final, nested classes annotated with @Configuration.
2026-09-18T12:09:15.205Z INFO 2720100 --- [Pool-1-worker-3] .b.t.c.SpringBootTestContextBootstrapper : Found @SpringBootConfiguration org.vaadin.addons.dramafinder.tests.TestServer for test class org.vaadin.addons.dramafinder.tests.it.ButtonViewIT
2026-09-18T12:09:15.210Z INFO 2720100 --- [Pool-1-worker-3] t.c.s.AnnotationConfigContextLoaderUtils : Could not detect default configuration classes for test class [org.vaadin.addons.dramafinder.tests.it.ButtonViewIT]: ButtonViewIT does not declare any static, non-private, non-final, nested classes annotated with @Configuration.
2026-09-18T12:09:15.211Z INFO 2720100 --- [Pool-1-worker-3] t.c.s.AnnotationConfigContextLoaderUtils : Could not detect default configuration classes for test class [org.vaadin.addons.dramafinder.tests.it.SpringPlaywrightIT]: SpringPlaywrightIT does not declare any static, non-private, non-final, nested classes annotated with @Configuration.
2026-09-18T12:09:15.212Z INFO 2720100 --- [Pool-1-worker-3] t.c.s.AnnotationConfigContextLoaderUtils : Could not detect default configuration classes for test class [org.vaadin.addons.dramafinder.AbstractBasePlaywrightIT]: AbstractBasePlaywrightIT does not declare any static, non-private, non-final, nested classes annotated with @Configuration.
2026-09-18T12:09:15.213Z INFO 2720100 --- [Pool-1-worker-3] .b.t.c.SpringBootTestContextBootstrapper : Found @SpringBootConfiguration org.vaadin.addons.dramafinder.tests.TestServer for test class org.vaadin.addons.dramafinder.tests.it.ButtonViewIT
[INFO] Tests run: 33, Failures: 0, Errors: 0, Skipped: 0, Time elapsed: 67.24 s -- in org.vaadin.addons.dramafinder.tests.it.ComboBoxViewIT
[INFO] Running org.vaadin.addons.dramafinder.tests.it.ProgressBarViewIT
2026-09-18T12:09:38.819Z INFO 2720100 --- [Pool-1-worker-1] t.c.s.AnnotationConfigContextLoaderUtils : Could not detect default configuration classes for test class [org.vaadin.addons.dramafinder.tests.it.ProgressBarViewIT]: ProgressBarViewIT does not declare any static, non-private, non-final, nested classes annotated with @Configuration.
2026-09-18T12:09:38.826Z INFO 2720100 --- [Pool-1-worker-1] .b.t.c.SpringBootTestContextBootstrapper : Found @SpringBootConfiguration org.vaadin.addons.dramafinder.tests.TestServer for test class org.vaadin.addons.dramafinder.tests.it.ProgressBarViewIT
2026-09-18T12:09:38.826Z INFO 2720100 --- [Pool-1-worker-1] t.c.s.AnnotationConfigContextLoaderUtils : Could not detect default configuration classes for test class [org.vaadin.addons.dramafinder.tests.it.ProgressBarViewIT]: ProgressBarViewIT does not declare any static, non-private, non-final, nested classes annotated with @Configuration.
2026-09-18T12:09:38.827Z INFO 2720100 --- [Pool-1-worker-1] t.c.s.AnnotationConfigContextLoaderUtils : Could not detect default configuration classes for test class [org.vaadin.addons.dramafinder.tests.it.SpringPlaywrightIT]: SpringPlaywrightIT does not declare any static, non-private, non-final, nested classes annotated with @Configuration.
2026-09-18T12:09:38.827Z INFO 2720100 --- [Pool-1-worker-1] t.c.s.AnnotationConfigContextLoaderUtils : Could not detect default configuration classes for test class [org.vaadin.addons.dramafinder.AbstractBasePlaywrightIT]: AbstractBasePlaywrightIT does not declare any static, non-private, non-final, nested classes annotated with @Configuration.
2026-09-18T12:09:38.831Z INFO 2720100 --- [Pool-1-worker-1] .b.t.c.SpringBootTestContextBootstrapper : Found @SpringBootConfiguration org.vaadin.addons.dramafinder.tests.TestServer for test class org.vaadin.addons.dramafinder.tests.it.ProgressBarViewIT
[ERROR] Tests run: 13, Failures: 1, Errors: 0, Skipped: 0, Time elapsed: 26.80 s <<< FAILURE! -- in org.vaadin.addons.dramafinder.tests.it.ButtonViewIT
[ERROR] org.vaadin.addons.dramafinder.tests.it.ButtonViewIT.testHasThemeVariant -- Time elapsed: 6.396 s <<< FAILURE!
org.opentest4j.AssertionFailedError:
Locator expected to have attribute 'theme'
Expected: small primary
Received: primary small
Call log:
- Assert "hasAttribute" with timeout 5000ms
- waiting for getByRole(AriaRole.BUTTON, new Page.GetByRoleOptions().setName("Combined Variants Button")).and(locator("vaadin-button"))
8 × locator resolved to Combined Variants Button
- unexpected value "primary small"
at com.microsoft.playwright.impl.AssertionsBase.expectImpl(AssertionsBase.java:74)
at com.microsoft.playwright.impl.AssertionsBase.expectImpl(AssertionsBase.java:47)
at com.microsoft.playwright.impl.AssertionsBase.expectImpl(AssertionsBase.java:39)
at com.microsoft.playwright.impl.LocatorAssertionsImpl.hasAttribute(LocatorAssertionsImpl.java:190)
at com.microsoft.playwright.impl.LocatorAssertionsImpl.hasAttribute(LocatorAssertionsImpl.java:170)
at com.microsoft.playwright.assertions.LocatorAssertions.hasAttribute(LocatorAssertions.java:1513)
at org.vaadin.addons.dramafinder.element.shared.HasThemeElement.assertTheme(HasThemeElement.java:26)
at org.vaadin.addons.dramafinder.tests.it.ButtonViewIT.testHasThemeVariant(ButtonViewIT.java:50)
[INFO] Running org.vaadin.addons.dramafinder.tests.it.LoginOverlayViewIT
2026-09-18T12:09:42.006Z INFO 2720100 --- [Pool-1-worker-3] t.c.s.AnnotationConfigContextLoaderUtils : Could not detect default configuration classes for test class [org.vaadin.addons.dramafinder.tests.it.LoginOverlayViewIT]: LoginOverlayViewIT does not declare any static, non-private, non-final, nested classes annotated with @Configuration.
2026-09-18T12:09:42.008Z INFO 2720100 --- [Pool-1-worker-3] .b.t.c.SpringBootTestContextBootstrapper : Found @SpringBootConfiguration org.vaadin.addons.dramafinder.tests.TestServer for test class org.vaadin.addons.dramafinder.tests.it.LoginOverlayViewIT
2026-09-18T12:09:42.012Z INFO 2720100 --- [Pool-1-worker-3] t.c.s.AnnotationConfigContextLoaderUtils : Could not detect default configuration classes for test class [org.vaadin.addons.dramafinder.tests.it.LoginOverlayViewIT]: LoginOverlayViewIT does not declare any static, non-private, non-final, nested classes annotated with @Configuration.
2026-09-18T12:09:42.013Z INFO 2720100 --- [Pool-1-worker-3] t.c.s.AnnotationConfigContextLoaderUtils : Could not detect default configuration classes for test class [org.vaadin.addons.dramafinder.tests.it.SpringPlaywrightIT]: SpringPlaywrightIT does not declare any static, non-private, non-final, nested classes annotated with @Configuration.
2026-09-18T12:09:42.013Z INFO 2720100 --- [Pool-1-worker-3] t.c.s.AnnotationConfigContextLoaderUtils : Could not detect default configuration classes for test class [org.vaadin.addons.dramafinder.AbstractBasePlaywrightIT]: AbstractBasePlaywrightIT does not declare any static, non-private, non-final, nested classes annotated with @Configuration.
2026-09-18T12:09:42.016Z INFO 2720100 --- [Pool-1-worker-3] .b.t.c.SpringBootTestContextBootstrapper : Found @SpringBootConfiguration org.vaadin.addons.dramafinder.tests.TestServer for test class org.vaadin.addons.dramafinder.tests.it.LoginOverlayViewIT
[INFO] Tests run: 4, Failures: 0, Errors: 0, Skipped: 0, Time elapsed: 6.976 s -- in org.vaadin.addons.dramafinder.tests.it.ProgressBarViewIT
[INFO] Running org.vaadin.addons.dramafinder.tests.it.NotificationViewIT
2026-09-18T12:09:45.796Z INFO 2720100 --- [Pool-1-worker-1] t.c.s.AnnotationConfigContextLoaderUtils : Could not detect default configuration classes for test class [org.vaadin.addons.dramafinder.tests.it.NotificationViewIT]: NotificationViewIT does not declare any static, non-private, non-final, nested classes annotated with @Configuration.
2026-09-18T12:09:45.798Z INFO 2720100 --- [Pool-1-worker-1] .b.t.c.SpringBootTestContextBootstrapper : Found @SpringBootConfiguration org.vaadin.addons.dramafinder.tests.TestServer for test class org.vaadin.addons.dramafinder.tests.it.NotificationViewIT
2026-09-18T12:09:45.799Z INFO 2720100 --- [Pool-1-worker-1] t.c.s.AnnotationConfigContextLoaderUtils : Could not detect default configuration classes for test class [org.vaadin.addons.dramafinder.tests.it.NotificationViewIT]: NotificationViewIT does not declare any static, non-private, non-final, nested classes annotated with @Configuration.
2026-09-18T12:09:45.799Z INFO 2720100 --- [Pool-1-worker-1] t.c.s.AnnotationConfigContextLoaderUtils : Could not detect default configuration classes for test class [org.vaadin.addons.dramafinder.tests.it.SpringPlaywrightIT]: SpringPlaywrightIT does not declare any static, non-private, non-final, nested classes annotated with @Configuration.
2026-09-18T12:09:45.799Z INFO 2720100 --- [Pool-1-worker-1] t.c.s.AnnotationConfigContextLoaderUtils : Could not detect default configuration classes for test class [org.vaadin.addons.dramafinder.AbstractBasePlaywrightIT]: AbstractBasePlaywrightIT does not declare any static, non-private, non-final, nested classes annotated with @Configuration.
2026-09-18T12:09:45.800Z INFO 2720100 --- [Pool-1-worker-1] .b.t.c.SpringBootTestContextBootstrapper : Found @SpringBootConfiguration org.vaadin.addons.dramafinder.tests.TestServer for test class org.vaadin.addons.dramafinder.tests.it.NotificationViewIT
[INFO] Tests run: 5, Failures: 0, Errors: 0, Skipped: 0, Time elapsed: 11.93 s -- in org.vaadin.addons.dramafinder.tests.it.LoginOverlayViewIT
[INFO] Running org.vaadin.addons.dramafinder.tests.it.DateTimePickerViewIT
2026-09-18T12:09:53.936Z INFO 2720100 --- [Pool-1-worker-3] t.c.s.AnnotationConfigContextLoaderUtils : Could not detect default configuration classes for test class [org.vaadin.addons.dramafinder.tests.it.DateTimePickerViewIT]: DateTimePickerViewIT does not declare any static, non-private, non-final, nested classes annotated with @Configuration.
2026-09-18T12:09:53.937Z INFO 2720100 --- [Pool-1-worker-3] .b.t.c.SpringBootTestContextBootstrapper : Found @SpringBootConfiguration org.vaadin.addons.dramafinder.tests.TestServer for test class org.vaadin.addons.dramafinder.tests.it.DateTimePickerViewIT
2026-09-18T12:09:53.939Z INFO 2720100 --- [Pool-1-worker-3] t.c.s.AnnotationConfigContextLoaderUtils : Could not detect default configuration classes for test class [org.vaadin.addons.dramafinder.tests.it.DateTimePickerViewIT]: DateTimePickerViewIT does not declare any static, non-private, non-final, nested classes annotated with @Configuration.
2026-09-18T12:09:53.940Z INFO 2720100 --- [Pool-1-worker-3] t.c.s.AnnotationConfigContextLoaderUtils : Could not detect default configuration classes for test class [org.vaadin.addons.dramafinder.tests.it.SpringPlaywrightIT]: SpringPlaywrightIT does not declare any static, non-private, non-final, nested classes annotated with @Configuration.
2026-09-18T12:09:53.940Z INFO 2720100 --- [Pool-1-worker-3] t.c.s.AnnotationConfigContextLoaderUtils : Could not detect default configuration classes for test class [org.vaadin.addons.dramafinder.AbstractBasePlaywrightIT]: AbstractBasePlaywrightIT does not declare any static, non-private, non-final, nested classes annotated with @Configuration.
2026-09-18T12:09:53.940Z INFO 2720100 --- [Pool-1-worker-3] .b.t.c.SpringBootTestContextBootstrapper : Found @SpringBootConfiguration org.vaadin.addons.dramafinder.tests.TestServer for test class org.vaadin.addons.dramafinder.tests.it.DateTimePickerViewIT
[INFO] Tests run: 17, Failures: 0, Errors: 0, Skipped: 0, Time elapsed: 50.14 s -- in org.vaadin.addons.dramafinder.tests.it.TreeGridMultiSelectViewIT
[INFO] Running org.vaadin.addons.dramafinder.tests.it.VirtualListViewIT
2026-09-18T12:09:54.245Z INFO 2720100 --- [Pool-1-worker-2] t.c.s.AnnotationConfigContextLoaderUtils : Could not detect default configuration classes for test class [org.vaadin.addons.dramafinder.tests.it.VirtualListViewIT]: VirtualListViewIT does not declare any static, non-private, non-final, nested classes annotated with @Configuration.
2026-09-18T12:09:54.247Z INFO 2720100 --- [Pool-1-worker-2] .b.t.c.SpringBootTestContextBootstrapper : Found @SpringBootConfiguration org.vaadin.addons.dramafinder.tests.TestServer for test class org.vaadin.addons.dramafinder.tests.it.VirtualListViewIT
2026-09-18T12:09:54.253Z INFO 2720100 --- [Pool-1-worker-2] t.c.s.AnnotationConfigContextLoaderUtils : Could not detect default configuration classes for test class [org.vaadin.addons.dramafinder.tests.it.VirtualListViewIT]: VirtualListViewIT does not declare any static, non-private, non-final, nested classes annotated with @Configuration.
2026-09-18T12:09:54.253Z INFO 2720100 --- [Pool-1-worker-2] t.c.s.AnnotationConfigContextLoaderUtils : Could not detect default configuration classes for test class [org.vaadin.addons.dramafinder.tests.it.SpringPlaywrightIT]: SpringPlaywrightIT does not declare any static, non-private, non-final, nested classes annotated with @Configuration.
2026-09-18T12:09:54.256Z INFO 2720100 --- [Pool-1-worker-2] t.c.s.AnnotationConfigContextLoaderUtils : Could not detect default configuration classes for test class [org.vaadin.addons.dramafinder.AbstractBasePlaywrightIT]: AbstractBasePlaywrightIT does not declare any static, non-private, non-final, nested classes annotated with @Configuration.
2026-09-18T12:09:54.262Z INFO 2720100 --- [Pool-1-worker-2] .b.t.c.SpringBootTestContextBootstrapper : Found @SpringBootConfiguration org.vaadin.addons.dramafinder.tests.TestServer for test class org.vaadin.addons.dramafinder.tests.it.VirtualListViewIT
[INFO] Tests run: 6, Failures: 0, Errors: 0, Skipped: 0, Time elapsed: 13.39 s -- in org.vaadin.addons.dramafinder.tests.it.NotificationViewIT
[INFO] Running org.vaadin.addons.dramafinder.tests.it.PasswordFieldGetByLabelIT
2026-09-18T12:09:59.192Z INFO 2720100 --- [Pool-1-worker-1] t.c.s.AnnotationConfigContextLoaderUtils : Could not detect default configuration classes for test class [org.vaadin.addons.dramafinder.tests.it.PasswordFieldGetByLabelIT]: PasswordFieldGetByLabelIT does not declare any static, non-private, non-final, nested classes annotated with @Configuration.
2026-09-18T12:09:59.193Z INFO 2720100 --- [Pool-1-worker-1] .b.t.c.SpringBootTestContextBootstrapper : Found @SpringBootConfiguration org.vaadin.addons.dramafinder.tests.TestServer for test class org.vaadin.addons.dramafinder.tests.it.PasswordFieldGetByLabelIT
2026-09-18T12:09:59.193Z INFO 2720100 --- [Pool-1-worker-1] t.c.s.AnnotationConfigContextLoaderUtils : Could not detect default configuration classes for test class [org.vaadin.addons.dramafinder.tests.it.PasswordFieldGetByLabelIT]: PasswordFieldGetByLabelIT does not declare any static, non-private, non-final, nested classes annotated with @Configuration.
2026-09-18T12:09:59.194Z INFO 2720100 --- [Pool-1-worker-1] t.c.s.AnnotationConfigContextLoaderUtils : Could not detect default configuration classes for test class [org.vaadin.addons.dramafinder.tests.it.SpringPlaywrightIT]: SpringPlaywrightIT does not declare any static, non-private, non-final, nested classes annotated with @Configuration.
2026-09-18T12:09:59.194Z INFO 2720100 --- [Pool-1-worker-1] t.c.s.AnnotationConfigContextLoaderUtils : Could not detect default configuration classes for test class [org.vaadin.addons.dramafinder.AbstractBasePlaywrightIT]: AbstractBasePlaywrightIT does not declare any static, non-private, non-final, nested classes annotated with @Configuration.
2026-09-18T12:09:59.194Z INFO 2720100 --- [Pool-1-worker-1] .b.t.c.SpringBootTestContextBootstrapper : Found @SpringBootConfiguration org.vaadin.addons.dramafinder.tests.TestServer for test class org.vaadin.addons.dramafinder.tests.it.PasswordFieldGetByLabelIT
[INFO] Tests run: 2, Failures: 0, Errors: 0, Skipped: 0, Time elapsed: 4.534 s -- in org.vaadin.addons.dramafinder.tests.it.PasswordFieldGetByLabelIT
[INFO] Running org.vaadin.addons.dramafinder.tests.it.UploadViewIT
2026-09-18T12:10:03.729Z INFO 2720100 --- [Pool-1-worker-1] t.c.s.AnnotationConfigContextLoaderUtils : Could not detect default configuration classes for test class [org.vaadin.addons.dramafinder.tests.it.UploadViewIT]: UploadViewIT does not declare any static, non-private, non-final, nested classes annotated with @Configuration.
2026-09-18T12:10:03.731Z INFO 2720100 --- [Pool-1-worker-1] .b.t.c.SpringBootTestContextBootstrapper : Found @SpringBootConfiguration org.vaadin.addons.dramafinder.tests.TestServer for test class org.vaadin.addons.dramafinder.tests.it.UploadViewIT
2026-09-18T12:10:03.731Z INFO 2720100 --- [Pool-1-worker-1] t.c.s.AnnotationConfigContextLoaderUtils : Could not detect default configuration classes for test class [org.vaadin.addons.dramafinder.tests.it.UploadViewIT]: UploadViewIT does not declare any static, non-private, non-final, nested classes annotated with @Configuration.
2026-09-18T12:10:03.731Z INFO 2720100 --- [Pool-1-worker-1] t.c.s.AnnotationConfigContextLoaderUtils : Could not detect default configuration classes for test class [org.vaadin.addons.dramafinder.tests.it.SpringPlaywrightIT]: SpringPlaywrightIT does not declare any static, non-private, non-final, nested classes annotated with @Configuration.
2026-09-18T12:10:03.732Z INFO 2720100 --- [Pool-1-worker-1] t.c.s.AnnotationConfigContextLoaderUtils : Could not detect default configuration classes for test class [org.vaadin.addons.dramafinder.AbstractBasePlaywrightIT]: AbstractBasePlaywrightIT does not declare any static, non-private, non-final, nested classes annotated with @Configuration.
2026-09-18T12:10:03.733Z INFO 2720100 --- [Pool-1-worker-1] .b.t.c.SpringBootTestContextBootstrapper : Found @SpringBootConfiguration org.vaadin.addons.dramafinder.tests.TestServer for test class org.vaadin.addons.dramafinder.tests.it.UploadViewIT
[INFO] Tests run: 3, Failures: 0, Errors: 0, Skipped: 0, Time elapsed: 7.715 s -- in org.vaadin.addons.dramafinder.tests.it.UploadViewIT
[INFO] Running org.vaadin.addons.dramafinder.tests.it.CheckboxViewIT
2026-09-18T12:10:11.454Z INFO 2720100 --- [Pool-1-worker-1] t.c.s.AnnotationConfigContextLoaderUtils : Could not detect default configuration classes for test class [org.vaadin.addons.dramafinder.tests.it.CheckboxViewIT]: CheckboxViewIT does not declare any static, non-private, non-final, nested classes annotated with @Configuration.
2026-09-18T12:10:11.463Z INFO 2720100 --- [Pool-1-worker-1] .b.t.c.SpringBootTestContextBootstrapper : Found @SpringBootConfiguration org.vaadin.addons.dramafinder.tests.TestServer for test class org.vaadin.addons.dramafinder.tests.it.CheckboxViewIT
2026-09-18T12:10:11.464Z INFO 2720100 --- [Pool-1-worker-1] t.c.s.AnnotationConfigContextLoaderUtils : Could not detect default configuration classes for test class [org.vaadin.addons.dramafinder.tests.it.CheckboxViewIT]: CheckboxViewIT does not declare any static, non-private, non-final, nested classes annotated with @Configuration.
2026-09-18T12:10:11.470Z INFO 2720100 --- [Pool-1-worker-1] t.c.s.AnnotationConfigContextLoaderUtils : Could not detect default configuration classes for test class [org.vaadin.addons.dramafinder.tests.it.SpringPlaywrightIT]: SpringPlaywrightIT does not declare any static, non-private, non-final, nested classes annotated with @Configuration.
2026-09-18T12:10:11.471Z INFO 2720100 --- [Pool-1-worker-1] t.c.s.AnnotationConfigContextLoaderUtils : Could not detect default configuration classes for test class [org.vaadin.addons.dramafinder.AbstractBasePlaywrightIT]: AbstractBasePlaywrightIT does not declare any static, non-private, non-final, nested classes annotated with @Configuration.
2026-09-18T12:10:11.472Z INFO 2720100 --- [Pool-1-worker-1] .b.t.c.SpringBootTestContextBootstrapper : Found @SpringBootConfiguration org.vaadin.addons.dramafinder.tests.TestServer for test class org.vaadin.addons.dramafinder.tests.it.CheckboxViewIT
[INFO] Tests run: 10, Failures: 0, Errors: 0, Skipped: 0, Time elapsed: 21.67 s -- in org.vaadin.addons.dramafinder.tests.it.DateTimePickerViewIT
[INFO] Running org.vaadin.addons.dramafinder.tests.it.GridDetailsViewIT
2026-09-18T12:10:15.596Z INFO 2720100 --- [Pool-1-worker-3] t.c.s.AnnotationConfigContextLoaderUtils : Could not detect default configuration classes for test class [org.vaadin.addons.dramafinder.tests.it.GridDetailsViewIT]: GridDetailsViewIT does not declare any static, non-private, non-final, nested classes annotated with @Configuration.
2026-09-18T12:10:15.602Z INFO 2720100 --- [Pool-1-worker-3] .b.t.c.SpringBootTestContextBootstrapper : Found @SpringBootConfiguration org.vaadin.addons.dramafinder.tests.TestServer for test class org.vaadin.addons.dramafinder.tests.it.GridDetailsViewIT
2026-09-18T12:10:15.603Z INFO 2720100 --- [Pool-1-worker-3] t.c.s.AnnotationConfigContextLoaderUtils : Could not detect default configuration classes for test class [org.vaadin.addons.dramafinder.tests.it.GridDetailsViewIT]: GridDetailsViewIT does not declare any static, non-private, non-final, nested classes annotated with @Configuration.
2026-09-18T12:10:15.606Z INFO 2720100 --- [Pool-1-worker-3] t.c.s.AnnotationConfigContextLoaderUtils : Could not detect default configuration classes for test class [org.vaadin.addons.dramafinder.tests.it.SpringPlaywrightIT]: SpringPlaywrightIT does not declare any static, non-private, non-final, nested classes annotated with @Configuration.
2026-09-18T12:10:15.606Z INFO 2720100 --- [Pool-1-worker-3] t.c.s.AnnotationConfigContextLoaderUtils : Could not detect default configuration classes for test class [org.vaadin.addons.dramafinder.AbstractBasePlaywrightIT]: AbstractBasePlaywrightIT does not declare any static, non-private, non-final, nested classes annotated with @Configuration.
2026-09-18T12:10:15.607Z INFO 2720100 --- [Pool-1-worker-3] .b.t.c.SpringBootTestContextBootstrapper : Found @SpringBootConfiguration org.vaadin.addons.dramafinder.tests.TestServer for test class org.vaadin.addons.dramafinder.tests.it.GridDetailsViewIT
[INFO] Tests run: 5, Failures: 0, Errors: 0, Skipped: 0, Time elapsed: 10.69 s -- in org.vaadin.addons.dramafinder.tests.it.GridDetailsViewIT
[INFO] Running org.vaadin.addons.dramafinder.tests.it.AccordionViewIT
2026-09-18T12:10:26.282Z INFO 2720100 --- [Pool-1-worker-3] t.c.s.AnnotationConfigContextLoaderUtils : Could not detect default configuration classes for test class [org.vaadin.addons.dramafinder.tests.it.AccordionViewIT]: AccordionViewIT does not declare any static, non-private, non-final, nested classes annotated with @Configuration.
2026-09-18T12:10:26.286Z INFO 2720100 --- [Pool-1-worker-3] .b.t.c.SpringBootTestContextBootstrapper : Found @SpringBootConfiguration org.vaadin.addons.dramafinder.tests.TestServer for test class org.vaadin.addons.dramafinder.tests.it.AccordionViewIT
2026-09-18T12:10:26.287Z INFO 2720100 --- [Pool-1-worker-3] t.c.s.AnnotationConfigContextLoaderUtils : Could not detect default configuration classes for test class [org.vaadin.addons.dramafinder.tests.it.AccordionViewIT]: AccordionViewIT does not declare any static, non-private, non-final, nested classes annotated with @Configuration.
2026-09-18T12:10:26.287Z INFO 2720100 --- [Pool-1-worker-3] t.c.s.AnnotationConfigContextLoaderUtils : Could not detect default configuration classes for test class [org.vaadin.addons.dramafinder.tests.it.SpringPlaywrightIT]: SpringPlaywrightIT does not declare any static, non-private, non-final, nested classes annotated with @Configuration.
2026-09-18T12:10:26.287Z INFO 2720100 --- [Pool-1-worker-3] t.c.s.AnnotationConfigContextLoaderUtils : Could not detect default configuration classes for test class [org.vaadin.addons.dramafinder.AbstractBasePlaywrightIT]: AbstractBasePlaywrightIT does not declare any static, non-private, non-final, nested classes annotated with @Configuration.
2026-09-18T12:10:26.288Z INFO 2720100 --- [Pool-1-worker-3] .b.t.c.SpringBootTestContextBootstrapper : Found @SpringBootConfiguration org.vaadin.addons.dramafinder.tests.TestServer for test class org.vaadin.addons.dramafinder.tests.it.AccordionViewIT
[INFO] Tests run: 11, Failures: 0, Errors: 0, Skipped: 0, Time elapsed: 16.92 s -- in org.vaadin.addons.dramafinder.tests.it.CheckboxViewIT
[INFO] Running org.vaadin.addons.dramafinder.tests.it.TextFieldViewIT
2026-09-18T12:10:28.375Z INFO 2720100 --- [Pool-1-worker-1] t.c.s.AnnotationConfigContextLoaderUtils : Could not detect default configuration classes for test class [org.vaadin.addons.dramafinder.tests.it.TextFieldViewIT]: TextFieldViewIT does not declare any static, non-private, non-final, nested classes annotated with @Configuration.
2026-09-18T12:10:28.380Z INFO 2720100 --- [Pool-1-worker-1] .b.t.c.SpringBootTestContextBootstrapper : Found @SpringBootConfiguration org.vaadin.addons.dramafinder.tests.TestServer for test class org.vaadin.addons.dramafinder.tests.it.TextFieldViewIT
2026-09-18T12:10:28.384Z INFO 2720100 --- [Pool-1-worker-1] t.c.s.AnnotationConfigContextLoaderUtils : Could not detect default configuration classes for test class [org.vaadin.addons.dramafinder.tests.it.TextFieldViewIT]: TextFieldViewIT does not declare any static, non-private, non-final, nested classes annotated with @Configuration.
2026-09-18T12:10:28.384Z INFO 2720100 --- [Pool-1-worker-1] t.c.s.AnnotationConfigContextLoaderUtils : Could not detect default configuration classes for test class [org.vaadin.addons.dramafinder.tests.it.SpringPlaywrightIT]: SpringPlaywrightIT does not declare any static, non-private, non-final, nested classes annotated with @Configuration.
2026-09-18T12:10:28.384Z INFO 2720100 --- [Pool-1-worker-1] t.c.s.AnnotationConfigContextLoaderUtils : Could not detect default configuration classes for test class [org.vaadin.addons.dramafinder.AbstractBasePlaywrightIT]: AbstractBasePlaywrightIT does not declare any static, non-private, non-final, nested classes annotated with @Configuration.
2026-09-18T12:10:28.385Z INFO 2720100 --- [Pool-1-worker-1] .b.t.c.SpringBootTestContextBootstrapper : Found @SpringBootConfiguration org.vaadin.addons.dramafinder.tests.TestServer for test class org.vaadin.addons.dramafinder.tests.it.TextFieldViewIT
[INFO] Tests run: 21, Failures: 0, Errors: 0, Skipped: 0, Time elapsed: 38.08 s -- in org.vaadin.addons.dramafinder.tests.it.VirtualListViewIT
[INFO] Running org.vaadin.addons.dramafinder.tests.it.MarkdownViewIT
2026-09-18T12:10:32.326Z INFO 2720100 --- [Pool-1-worker-2] t.c.s.AnnotationConfigContextLoaderUtils : Could not detect default configuration classes for test class [org.vaadin.addons.dramafinder.tests.it.MarkdownViewIT]: MarkdownViewIT does not declare any static, non-private, non-final, nested classes annotated with @Configuration.
2026-09-18T12:10:32.335Z INFO 2720100 --- [Pool-1-worker-2] .b.t.c.SpringBootTestContextBootstrapper : Found @SpringBootConfiguration org.vaadin.addons.dramafinder.tests.TestServer for test class org.vaadin.addons.dramafinder.tests.it.MarkdownViewIT
2026-09-18T12:10:32.338Z INFO 2720100 --- [Pool-1-worker-2] t.c.s.AnnotationConfigContextLoaderUtils : Could not detect default configuration classes for test class [org.vaadin.addons.dramafinder.tests.it.MarkdownViewIT]: MarkdownViewIT does not declare any static, non-private, non-final, nested classes annotated with @Configuration.
2026-09-18T12:10:32.339Z INFO 2720100 --- [Pool-1-worker-2] t.c.s.AnnotationConfigContextLoaderUtils : Could not detect default configuration classes for test class [org.vaadin.addons.dramafinder.tests.it.SpringPlaywrightIT]: SpringPlaywrightIT does not declare any static, non-private, non-final, nested classes annotated with @Configuration.
2026-09-18T12:10:32.339Z INFO 2720100 --- [Pool-1-worker-2] t.c.s.AnnotationConfigContextLoaderUtils : Could not detect default configuration classes for test class [org.vaadin.addons.dramafinder.AbstractBasePlaywrightIT]: AbstractBasePlaywrightIT does not declare any static, non-private, non-final, nested classes annotated with @Configuration.
2026-09-18T12:10:32.340Z INFO 2720100 --- [Pool-1-worker-2] .b.t.c.SpringBootTestContextBootstrapper : Found @SpringBootConfiguration org.vaadin.addons.dramafinder.tests.TestServer for test class org.vaadin.addons.dramafinder.tests.it.MarkdownViewIT
[INFO] Tests run: 3, Failures: 0, Errors: 0, Skipped: 0, Time elapsed: 6.209 s -- in org.vaadin.addons.dramafinder.tests.it.AccordionViewIT
[INFO] Running org.vaadin.addons.dramafinder.tests.it.CardViewIT
2026-09-18T12:10:32.499Z INFO 2720100 --- [Pool-1-worker-3] t.c.s.AnnotationConfigContextLoaderUtils : Could not detect default configuration classes for test class [org.vaadin.addons.dramafinder.tests.it.CardViewIT]: CardViewIT does not declare any static, non-private, non-final, nested classes annotated with @Configuration.
2026-09-18T12:10:32.504Z INFO 2720100 --- [Pool-1-worker-3] .b.t.c.SpringBootTestContextBootstrapper : Found @SpringBootConfiguration org.vaadin.addons.dramafinder.tests.TestServer for test class org.vaadin.addons.dramafinder.tests.it.CardViewIT
2026-09-18T12:10:32.508Z INFO 2720100 --- [Pool-1-worker-3] t.c.s.AnnotationConfigContextLoaderUtils : Could not detect default configuration classes for test class [org.vaadin.addons.dramafinder.tests.it.CardViewIT]: CardViewIT does not declare any static, non-private, non-final, nested classes annotated with @Configuration.
2026-09-18T12:10:32.508Z INFO 2720100 --- [Pool-1-worker-3] t.c.s.AnnotationConfigContextLoaderUtils : Could not detect default configuration classes for test class [org.vaadin.addons.dramafinder.tests.it.SpringPlaywrightIT]: SpringPlaywrightIT does not declare any static, non-private, non-final, nested classes annotated with @Configuration.
2026-09-18T12:10:32.508Z INFO 2720100 --- [Pool-1-worker-3] t.c.s.AnnotationConfigContextLoaderUtils : Could not detect default configuration classes for test class [org.vaadin.addons.dramafinder.AbstractBasePlaywrightIT]: AbstractBasePlaywrightIT does not declare any static, non-private, non-final, nested classes annotated with @Configuration.
2026-09-18T12:10:32.509Z INFO 2720100 --- [Pool-1-worker-3] .b.t.c.SpringBootTestContextBootstrapper : Found @SpringBootConfiguration org.vaadin.addons.dramafinder.tests.TestServer for test class org.vaadin.addons.dramafinder.tests.it.CardViewIT
[INFO] Tests run: 2, Failures: 0, Errors: 0, Skipped: 0, Time elapsed: 4.334 s -- in org.vaadin.addons.dramafinder.tests.it.CardViewIT
[INFO] Running org.vaadin.addons.dramafinder.tests.it.EmailFieldGetByLabelIT
2026-09-18T12:10:36.838Z INFO 2720100 --- [Pool-1-worker-3] t.c.s.AnnotationConfigContextLoaderUtils : Could not detect default configuration classes for test class [org.vaadin.addons.dramafinder.tests.it.EmailFieldGetByLabelIT]: EmailFieldGetByLabelIT does not declare any static, non-private, non-final, nested classes annotated with @Configuration.
2026-09-18T12:10:36.839Z INFO 2720100 --- [Pool-1-worker-3] .b.t.c.SpringBootTestContextBootstrapper : Found @SpringBootConfiguration org.vaadin.addons.dramafinder.tests.TestServer for test class org.vaadin.addons.dramafinder.tests.it.EmailFieldGetByLabelIT
2026-09-18T12:10:36.840Z INFO 2720100 --- [Pool-1-worker-3] t.c.s.AnnotationConfigContextLoaderUtils : Could not detect default configuration classes for test class [org.vaadin.addons.dramafinder.tests.it.EmailFieldGetByLabelIT]: EmailFieldGetByLabelIT does not declare any static, non-private, non-final, nested classes annotated with @Configuration.
2026-09-18T12:10:36.843Z INFO 2720100 --- [Pool-1-worker-3] t.c.s.AnnotationConfigContextLoaderUtils : Could not detect default configuration classes for test class [org.vaadin.addons.dramafinder.tests.it.SpringPlaywrightIT]: SpringPlaywrightIT does not declare any static, non-private, non-final, nested classes annotated with @Configuration.
2026-09-18T12:10:36.843Z INFO 2720100 --- [Pool-1-worker-3] t.c.s.AnnotationConfigContextLoaderUtils : Could not detect default configuration classes for test class [org.vaadin.addons.dramafinder.AbstractBasePlaywrightIT]: AbstractBasePlaywrightIT does not declare any static, non-private, non-final, nested classes annotated with @Configuration.
2026-09-18T12:10:36.844Z INFO 2720100 --- [Pool-1-worker-3] .b.t.c.SpringBootTestContextBootstrapper : Found @SpringBootConfiguration org.vaadin.addons.dramafinder.tests.TestServer for test class org.vaadin.addons.dramafinder.tests.it.EmailFieldGetByLabelIT
[INFO] Tests run: 3, Failures: 0, Errors: 0, Skipped: 0, Time elapsed: 5.194 s -- in org.vaadin.addons.dramafinder.tests.it.EmailFieldGetByLabelIT
[INFO] Running org.vaadin.addons.dramafinder.tests.it.TextAreaViewIT
2026-09-18T12:10:42.049Z INFO 2720100 --- [Pool-1-worker-3] t.c.s.AnnotationConfigContextLoaderUtils : Could not detect default configuration classes for test class [org.vaadin.addons.dramafinder.tests.it.TextAreaViewIT]: TextAreaViewIT does not declare any static, non-private, non-final, nested classes annotated with @Configuration.
2026-09-18T12:10:42.061Z INFO 2720100 --- [Pool-1-worker-3] .b.t.c.SpringBootTestContextBootstrapper : Found @SpringBootConfiguration org.vaadin.addons.dramafinder.tests.TestServer for test class org.vaadin.addons.dramafinder.tests.it.TextAreaViewIT
2026-09-18T12:10:42.062Z INFO 2720100 --- [Pool-1-worker-3] t.c.s.AnnotationConfigContextLoaderUtils : Could not detect default configuration classes for test class [org.vaadin.addons.dramafinder.tests.it.TextAreaViewIT]: TextAreaViewIT does not declare any static, non-private, non-final, nested classes annotated with @Configuration.
2026-09-18T12:10:42.066Z INFO 2720100 --- [Pool-1-worker-3] t.c.s.AnnotationConfigContextLoaderUtils : Could not detect default configuration classes for test class [org.vaadin.addons.dramafinder.tests.it.SpringPlaywrightIT]: SpringPlaywrightIT does not declare any static, non-private, non-final, nested classes annotated with @Configuration.
2026-09-18T12:10:42.066Z INFO 2720100 --- [Pool-1-worker-3] t.c.s.AnnotationConfigContextLoaderUtils : Could not detect default configuration classes for test class [org.vaadin.addons.dramafinder.AbstractBasePlaywrightIT]: AbstractBasePlaywrightIT does not declare any static, non-private, non-final, nested classes annotated with @Configuration.
2026-09-18T12:10:42.067Z INFO 2720100 --- [Pool-1-worker-3] .b.t.c.SpringBootTestContextBootstrapper : Found @SpringBootConfiguration org.vaadin.addons.dramafinder.tests.TestServer for test class org.vaadin.addons.dramafinder.tests.it.TextAreaViewIT
[INFO] Tests run: 9, Failures: 0, Errors: 0, Skipped: 0, Time elapsed: 15.30 s -- in org.vaadin.addons.dramafinder.tests.it.MarkdownViewIT
[INFO] Running org.vaadin.addons.dramafinder.tests.it.SelectGetByLabelIT
2026-09-18T12:10:47.630Z INFO 2720100 --- [Pool-1-worker-2] t.c.s.AnnotationConfigContextLoaderUtils : Could not detect default configuration classes for test class [org.vaadin.addons.dramafinder.tests.it.SelectGetByLabelIT]: SelectGetByLabelIT does not declare any static, non-private, non-final, nested classes annotated with @Configuration.
2026-09-18T12:10:47.639Z INFO 2720100 --- [Pool-1-worker-2] .b.t.c.SpringBootTestContextBootstrapper : Found @SpringBootConfiguration org.vaadin.addons.dramafinder.tests.TestServer for test class org.vaadin.addons.dramafinder.tests.it.SelectGetByLabelIT
2026-09-18T12:10:47.639Z INFO 2720100 --- [Pool-1-worker-2] t.c.s.AnnotationConfigContextLoaderUtils : Could not detect default configuration classes for test class [org.vaadin.addons.dramafinder.tests.it.SelectGetByLabelIT]: SelectGetByLabelIT does not declare any static, non-private, non-final, nested classes annotated with @Configuration.
2026-09-18T12:10:47.640Z INFO 2720100 --- [Pool-1-worker-2] t.c.s.AnnotationConfigContextLoaderUtils : Could not detect default configuration classes for test class [org.vaadin.addons.dramafinder.tests.it.SpringPlaywrightIT]: SpringPlaywrightIT does not declare any static, non-private, non-final, nested classes annotated with @Configuration.
2026-09-18T12:10:47.640Z INFO 2720100 --- [Pool-1-worker-2] t.c.s.AnnotationConfigContextLoaderUtils : Could not detect default configuration classes for test class [org.vaadin.addons.dramafinder.AbstractBasePlaywrightIT]: AbstractBasePlaywrightIT does not declare any static, non-private, non-final, nested classes annotated with @Configuration.
2026-09-18T12:10:47.640Z INFO 2720100 --- [Pool-1-worker-2] .b.t.c.SpringBootTestContextBootstrapper : Found @SpringBootConfiguration org.vaadin.addons.dramafinder.tests.TestServer for test class org.vaadin.addons.dramafinder.tests.it.SelectGetByLabelIT
[INFO] Tests run: 2, Failures: 0, Errors: 0, Skipped: 0, Time elapsed: 4.343 s -- in org.vaadin.addons.dramafinder.tests.it.SelectGetByLabelIT
[INFO] Running org.vaadin.addons.dramafinder.tests.it.AgentReportingIT
2026-09-18T12:10:51.977Z INFO 2720100 --- [Pool-1-worker-2] t.c.s.AnnotationConfigContextLoaderUtils : Could not detect default configuration classes for test class [org.vaadin.addons.dramafinder.tests.it.AgentReportingIT]: AgentReportingIT does not declare any static, non-private, non-final, nested classes annotated with @Configuration.
2026-09-18T12:10:51.978Z INFO 2720100 --- [Pool-1-worker-2] .b.t.c.SpringBootTestContextBootstrapper : Found @SpringBootConfiguration org.vaadin.addons.dramafinder.tests.TestServer for test class org.vaadin.addons.dramafinder.tests.it.AgentReportingIT
2026-09-18T12:10:51.979Z INFO 2720100 --- [Pool-1-worker-2] t.c.s.AnnotationConfigContextLoaderUtils : Could not detect default configuration classes for test class [org.vaadin.addons.dramafinder.tests.it.AgentReportingIT]: AgentReportingIT does not declare any static, non-private, non-final, nested classes annotated with @Configuration.
2026-09-18T12:10:51.979Z INFO 2720100 --- [Pool-1-worker-2] t.c.s.AnnotationConfigContextLoaderUtils : Could not detect default configuration classes for test class [org.vaadin.addons.dramafinder.tests.it.SpringPlaywrightIT]: SpringPlaywrightIT does not declare any static, non-private, non-final, nested classes annotated with @Configuration.
2026-09-18T12:10:51.979Z INFO 2720100 --- [Pool-1-worker-2] t.c.s.AnnotationConfigContextLoaderUtils : Could not detect default configuration classes for test class [org.vaadin.addons.dramafinder.AbstractBasePlaywrightIT]: AbstractBasePlaywrightIT does not declare any static, non-private, non-final, nested classes annotated with @Configuration.
2026-09-18T12:10:51.980Z INFO 2720100 --- [Pool-1-worker-2] .b.t.c.SpringBootTestContextBootstrapper : Found @SpringBootConfiguration org.vaadin.addons.dramafinder.tests.TestServer for test class org.vaadin.addons.dramafinder.tests.it.AgentReportingIT
[INFO] Tests run: 6, Failures: 0, Errors: 0, Skipped: 0, Time elapsed: 13.13 s -- in org.vaadin.addons.dramafinder.tests.it.AgentReportingIT
[INFO] Running org.vaadin.addons.dramafinder.tests.it.MessageInputViewIT
2026-09-18T12:11:05.107Z INFO 2720100 --- [Pool-1-worker-2] t.c.s.AnnotationConfigContextLoaderUtils : Could not detect default configuration classes for test class [org.vaadin.addons.dramafinder.tests.it.MessageInputViewIT]: MessageInputViewIT does not declare any static, non-private, non-final, nested classes annotated with @Configuration.
2026-09-18T12:11:05.111Z INFO 2720100 --- [Pool-1-worker-2] .b.t.c.SpringBootTestContextBootstrapper : Found @SpringBootConfiguration org.vaadin.addons.dramafinder.tests.TestServer for test class org.vaadin.addons.dramafinder.tests.it.MessageInputViewIT
2026-09-18T12:11:05.114Z INFO 2720100 --- [Pool-1-worker-2] t.c.s.AnnotationConfigContextLoaderUtils : Could not detect default configuration classes for test class [org.vaadin.addons.dramafinder.tests.it.MessageInputViewIT]: MessageInputViewIT does not declare any static, non-private, non-final, nested classes annotated with @Configuration.
2026-09-18T12:11:05.114Z INFO 2720100 --- [Pool-1-worker-2] t.c.s.AnnotationConfigContextLoaderUtils : Could not detect default configuration classes for test class [org.vaadin.addons.dramafinder.tests.it.SpringPlaywrightIT]: SpringPlaywrightIT does not declare any static, non-private, non-final, nested classes annotated with @Configuration.
2026-09-18T12:11:05.114Z INFO 2720100 --- [Pool-1-worker-2] t.c.s.AnnotationConfigContextLoaderUtils : Could not detect default configuration classes for test class [org.vaadin.addons.dramafinder.AbstractBasePlaywrightIT]: AbstractBasePlaywrightIT does not declare any static, non-private, non-final, nested classes annotated with @Configuration.
2026-09-18T12:11:05.115Z INFO 2720100 --- [Pool-1-worker-2] .b.t.c.SpringBootTestContextBootstrapper : Found @SpringBootConfiguration org.vaadin.addons.dramafinder.tests.TestServer for test class org.vaadin.addons.dramafinder.tests.it.MessageInputViewIT
[INFO] Tests run: 24, Failures: 0, Errors: 0, Skipped: 0, Time elapsed: 44.14 s -- in org.vaadin.addons.dramafinder.tests.it.TextFieldViewIT
[INFO] Running org.vaadin.addons.dramafinder.tests.it.ComboBoxGetByLabelIT
2026-09-18T12:11:12.525Z INFO 2720100 --- [Pool-1-worker-1] t.c.s.AnnotationConfigContextLoaderUtils : Could not detect default configuration classes for test class [org.vaadin.addons.dramafinder.tests.it.ComboBoxGetByLabelIT]: ComboBoxGetByLabelIT does not declare any static, non-private, non-final, nested classes annotated with @Configuration.
2026-09-18T12:11:12.526Z INFO 2720100 --- [Pool-1-worker-1] .b.t.c.SpringBootTestContextBootstrapper : Found @SpringBootConfiguration org.vaadin.addons.dramafinder.tests.TestServer for test class org.vaadin.addons.dramafinder.tests.it.ComboBoxGetByLabelIT
2026-09-18T12:11:12.527Z INFO 2720100 --- [Pool-1-worker-1] t.c.s.AnnotationConfigContextLoaderUtils : Could not detect default configuration classes for test class [org.vaadin.addons.dramafinder.tests.it.ComboBoxGetByLabelIT]: ComboBoxGetByLabelIT does not declare any static, non-private, non-final, nested classes annotated with @Configuration.
2026-09-18T12:11:12.528Z INFO 2720100 --- [Pool-1-worker-1] t.c.s.AnnotationConfigContextLoaderUtils : Could not detect default configuration classes for test class [org.vaadin.addons.dramafinder.tests.it.SpringPlaywrightIT]: SpringPlaywrightIT does not declare any static, non-private, non-final, nested classes annotated with @Configuration.
2026-09-18T12:11:12.528Z INFO 2720100 --- [Pool-1-worker-1] t.c.s.AnnotationConfigContextLoaderUtils : Could not detect default configuration classes for test class [org.vaadin.addons.dramafinder.AbstractBasePlaywrightIT]: AbstractBasePlaywrightIT does not declare any static, non-private, non-final, nested classes annotated with @Configuration.
2026-09-18T12:11:12.529Z INFO 2720100 --- [Pool-1-worker-1] .b.t.c.SpringBootTestContextBootstrapper : Found @SpringBootConfiguration org.vaadin.addons.dramafinder.tests.TestServer for test class org.vaadin.addons.dramafinder.tests.it.ComboBoxGetByLabelIT
[INFO] Tests run: 3, Failures: 0, Errors: 0, Skipped: 0, Time elapsed: 4.938 s -- in org.vaadin.addons.dramafinder.tests.it.ComboBoxGetByLabelIT
[INFO] Running org.vaadin.addons.dramafinder.tests.it.TextFieldGetByLabelIT
2026-09-18T12:11:17.470Z INFO 2720100 --- [Pool-1-worker-1] t.c.s.AnnotationConfigContextLoaderUtils : Could not detect default configuration classes for test class [org.vaadin.addons.dramafinder.tests.it.TextFieldGetByLabelIT]: TextFieldGetByLabelIT does not declare any static, non-private, non-final, nested classes annotated with @Configuration.
2026-09-18T12:11:17.474Z INFO 2720100 --- [Pool-1-worker-1] .b.t.c.SpringBootTestContextBootstrapper : Found @SpringBootConfiguration org.vaadin.addons.dramafinder.tests.TestServer for test class org.vaadin.addons.dramafinder.tests.it.TextFieldGetByLabelIT
2026-09-18T12:11:17.475Z INFO 2720100 --- [Pool-1-worker-1] t.c.s.AnnotationConfigContextLoaderUtils : Could not detect default configuration classes for test class [org.vaadin.addons.dramafinder.tests.it.TextFieldGetByLabelIT]: TextFieldGetByLabelIT does not declare any static, non-private, non-final, nested classes annotated with @Configuration.
2026-09-18T12:11:17.475Z INFO 2720100 --- [Pool-1-worker-1] t.c.s.AnnotationConfigContextLoaderUtils : Could not detect default configuration classes for test class [org.vaadin.addons.dramafinder.tests.it.SpringPlaywrightIT]: SpringPlaywrightIT does not declare any static, non-private, non-final, nested classes annotated with @Configuration.
2026-09-18T12:11:17.476Z INFO 2720100 --- [Pool-1-worker-1] t.c.s.AnnotationConfigContextLoaderUtils : Could not detect default configuration classes for test class [org.vaadin.addons.dramafinder.AbstractBasePlaywrightIT]: AbstractBasePlaywrightIT does not declare any static, non-private, non-final, nested classes annotated with @Configuration.
2026-09-18T12:11:17.478Z INFO 2720100 --- [Pool-1-worker-1] .b.t.c.SpringBootTestContextBootstrapper : Found @SpringBootConfiguration org.vaadin.addons.dramafinder.tests.TestServer for test class org.vaadin.addons.dramafinder.tests.it.TextFieldGetByLabelIT
[INFO] Tests run: 8, Failures: 0, Errors: 0, Skipped: 0, Time elapsed: 12.66 s -- in org.vaadin.addons.dramafinder.tests.it.MessageInputViewIT
[INFO] Running org.vaadin.addons.dramafinder.tests.it.DatePickerGetByLabelIT
2026-09-18T12:11:17.768Z INFO 2720100 --- [Pool-1-worker-2] t.c.s.AnnotationConfigContextLoaderUtils : Could not detect default configuration classes for test class [org.vaadin.addons.dramafinder.tests.it.DatePickerGetByLabelIT]: DatePickerGetByLabelIT does not declare any static, non-private, non-final, nested classes annotated with @Configuration.
2026-09-18T12:11:17.768Z INFO 2720100 --- [Pool-1-worker-2] .b.t.c.SpringBootTestContextBootstrapper : Found @SpringBootConfiguration org.vaadin.addons.dramafinder.tests.TestServer for test class org.vaadin.addons.dramafinder.tests.it.DatePickerGetByLabelIT
2026-09-18T12:11:17.769Z INFO 2720100 --- [Pool-1-worker-2] t.c.s.AnnotationConfigContextLoaderUtils : Could not detect default configuration classes for test class [org.vaadin.addons.dramafinder.tests.it.DatePickerGetByLabelIT]: DatePickerGetByLabelIT does not declare any static, non-private, non-final, nested classes annotated with @Configuration.
2026-09-18T12:11:17.769Z INFO 2720100 --- [Pool-1-worker-2] t.c.s.AnnotationConfigContextLoaderUtils : Could not detect default configuration classes for test class [org.vaadin.addons.dramafinder.tests.it.SpringPlaywrightIT]: SpringPlaywrightIT does not declare any static, non-private, non-final, nested classes annotated with @Configuration.
2026-09-18T12:11:17.769Z INFO 2720100 --- [Pool-1-worker-2] t.c.s.AnnotationConfigContextLoaderUtils : Could not detect default configuration classes for test class [org.vaadin.addons.dramafinder.AbstractBasePlaywrightIT]: AbstractBasePlaywrightIT does not declare any static, non-private, non-final, nested classes annotated with @Configuration.
2026-09-18T12:11:17.770Z INFO 2720100 --- [Pool-1-worker-2] .b.t.c.SpringBootTestContextBootstrapper : Found @SpringBootConfiguration org.vaadin.addons.dramafinder.tests.TestServer for test class org.vaadin.addons.dramafinder.tests.it.DatePickerGetByLabelIT
[INFO] Tests run: 3, Failures: 0, Errors: 0, Skipped: 0, Time elapsed: 5.062 s -- in org.vaadin.addons.dramafinder.tests.it.DatePickerGetByLabelIT
[INFO] Running org.vaadin.addons.dramafinder.tests.it.DialogViewIT
2026-09-18T12:11:22.834Z INFO 2720100 --- [Pool-1-worker-2] t.c.s.AnnotationConfigContextLoaderUtils : Could not detect default configuration classes for test class [org.vaadin.addons.dramafinder.tests.it.DialogViewIT]: DialogViewIT does not declare any static, non-private, non-final, nested classes annotated with @Configuration.
2026-09-18T12:11:22.838Z INFO 2720100 --- [Pool-1-worker-2] .b.t.c.SpringBootTestContextBootstrapper : Found @SpringBootConfiguration org.vaadin.addons.dramafinder.tests.TestServer for test class org.vaadin.addons.dramafinder.tests.it.DialogViewIT
2026-09-18T12:11:22.838Z INFO 2720100 --- [Pool-1-worker-2] t.c.s.AnnotationConfigContextLoaderUtils : Could not detect default configuration classes for test class [org.vaadin.addons.dramafinder.tests.it.DialogViewIT]: DialogViewIT does not declare any static, non-private, non-final, nested classes annotated with @Configuration.
2026-09-18T12:11:22.838Z INFO 2720100 --- [Pool-1-worker-2] t.c.s.AnnotationConfigContextLoaderUtils : Could not detect default configuration classes for test class [org.vaadin.addons.dramafinder.tests.it.SpringPlaywrightIT]: SpringPlaywrightIT does not declare any static, non-private, non-final, nested classes annotated with @Configuration.
2026-09-18T12:11:22.838Z INFO 2720100 --- [Pool-1-worker-2] t.c.s.AnnotationConfigContextLoaderUtils : Could not detect default configuration classes for test class [org.vaadin.addons.dramafinder.AbstractBasePlaywrightIT]: AbstractBasePlaywrightIT does not declare any static, non-private, non-final, nested classes annotated with @Configuration.
2026-09-18T12:11:22.839Z INFO 2720100 --- [Pool-1-worker-2] .b.t.c.SpringBootTestContextBootstrapper : Found @SpringBootConfiguration org.vaadin.addons.dramafinder.tests.TestServer for test class org.vaadin.addons.dramafinder.tests.it.DialogViewIT
[INFO] Tests run: 23, Failures: 0, Errors: 0, Skipped: 0, Time elapsed: 41.16 s -- in org.vaadin.addons.dramafinder.tests.it.TextAreaViewIT
[INFO] Running org.vaadin.addons.dramafinder.tests.it.BigDecimalFieldGetByLabelIT
2026-09-18T12:11:23.206Z INFO 2720100 --- [Pool-1-worker-3] t.c.s.AnnotationConfigContextLoaderUtils : Could not detect default configuration classes for test class [org.vaadin.addons.dramafinder.tests.it.BigDecimalFieldGetByLabelIT]: BigDecimalFieldGetByLabelIT does not declare any static, non-private, non-final, nested classes annotated with @Configuration.
2026-09-18T12:11:23.207Z INFO 2720100 --- [Pool-1-worker-3] .b.t.c.SpringBootTestContextBootstrapper : Found @SpringBootConfiguration org.vaadin.addons.dramafinder.tests.TestServer for test class org.vaadin.addons.dramafinder.tests.it.BigDecimalFieldGetByLabelIT
2026-09-18T12:11:23.207Z INFO 2720100 --- [Pool-1-worker-3] t.c.s.AnnotationConfigContextLoaderUtils : Could not detect default configuration classes for test class [org.vaadin.addons.dramafinder.tests.it.BigDecimalFieldGetByLabelIT]: BigDecimalFieldGetByLabelIT does not declare any static, non-private, non-final, nested classes annotated with @Configuration.
2026-09-18T12:11:23.208Z INFO 2720100 --- [Pool-1-worker-3] t.c.s.AnnotationConfigContextLoaderUtils : Could not detect default configuration classes for test class [org.vaadin.addons.dramafinder.tests.it.SpringPlaywrightIT]: SpringPlaywrightIT does not declare any static, non-private, non-final, nested classes annotated with @Configuration.
2026-09-18T12:11:23.208Z INFO 2720100 --- [Pool-1-worker-3] t.c.s.AnnotationConfigContextLoaderUtils : Could not detect default configuration classes for test class [org.vaadin.addons.dramafinder.AbstractBasePlaywrightIT]: AbstractBasePlaywrightIT does not declare any static, non-private, non-final, nested classes annotated with @Configuration.
2026-09-18T12:11:23.209Z INFO 2720100 --- [Pool-1-worker-3] .b.t.c.SpringBootTestContextBootstrapper : Found @SpringBootConfiguration org.vaadin.addons.dramafinder.tests.TestServer for test class org.vaadin.addons.dramafinder.tests.it.BigDecimalFieldGetByLabelIT
[INFO] Tests run: 3, Failures: 0, Errors: 0, Skipped: 0, Time elapsed: 4.779 s -- in org.vaadin.addons.dramafinder.tests.it.BigDecimalFieldGetByLabelIT
[INFO] Running org.vaadin.addons.dramafinder.tests.it.TreeGridBasicViewIT
2026-09-18T12:11:27.984Z INFO 2720100 --- [Pool-1-worker-3] t.c.s.AnnotationConfigContextLoaderUtils : Could not detect default configuration classes for test class [org.vaadin.addons.dramafinder.tests.it.TreeGridBasicViewIT]: TreeGridBasicViewIT does not declare any static, non-private, non-final, nested classes annotated with @Configuration.
2026-09-18T12:11:27.985Z INFO 2720100 --- [Pool-1-worker-3] .b.t.c.SpringBootTestContextBootstrapper : Found @SpringBootConfiguration org.vaadin.addons.dramafinder.tests.TestServer for test class org.vaadin.addons.dramafinder.tests.it.TreeGridBasicViewIT
2026-09-18T12:11:27.985Z INFO 2720100 --- [Pool-1-worker-3] t.c.s.AnnotationConfigContextLoaderUtils : Could not detect default configuration classes for test class [org.vaadin.addons.dramafinder.tests.it.TreeGridBasicViewIT]: TreeGridBasicViewIT does not declare any static, non-private, non-final, nested classes annotated with @Configuration.
2026-09-18T12:11:27.985Z INFO 2720100 --- [Pool-1-worker-3] t.c.s.AnnotationConfigContextLoaderUtils : Could not detect default configuration classes for test class [org.vaadin.addons.dramafinder.tests.it.SpringPlaywrightIT]: SpringPlaywrightIT does not declare any static, non-private, non-final, nested classes annotated with @Configuration.
2026-09-18T12:11:27.985Z INFO 2720100 --- [Pool-1-worker-3] t.c.s.AnnotationConfigContextLoaderUtils : Could not detect default configuration classes for test class [org.vaadin.addons.dramafinder.AbstractBasePlaywrightIT]: AbstractBasePlaywrightIT does not declare any static, non-private, non-final, nested classes annotated with @Configuration.
2026-09-18T12:11:27.986Z INFO 2720100 --- [Pool-1-worker-3] .b.t.c.SpringBootTestContextBootstrapper : Found @SpringBootConfiguration org.vaadin.addons.dramafinder.tests.TestServer for test class org.vaadin.addons.dramafinder.tests.it.TreeGridBasicViewIT
[INFO] Tests run: 8, Failures: 0, Errors: 0, Skipped: 0, Time elapsed: 11.36 s -- in org.vaadin.addons.dramafinder.tests.it.TextFieldGetByLabelIT
[INFO] Running org.vaadin.addons.dramafinder.tests.it.TimePickerGetByLabelIT
2026-09-18T12:11:28.831Z INFO 2720100 --- [Pool-1-worker-1] t.c.s.AnnotationConfigContextLoaderUtils : Could not detect default configuration classes for test class [org.vaadin.addons.dramafinder.tests.it.TimePickerGetByLabelIT]: TimePickerGetByLabelIT does not declare any static, non-private, non-final, nested classes annotated with @Configuration.
2026-09-18T12:11:28.832Z INFO 2720100 --- [Pool-1-worker-1] .b.t.c.SpringBootTestContextBootstrapper : Found @SpringBootConfiguration org.vaadin.addons.dramafinder.tests.TestServer for test class org.vaadin.addons.dramafinder.tests.it.TimePickerGetByLabelIT
2026-09-18T12:11:28.832Z INFO 2720100 --- [Pool-1-worker-1] t.c.s.AnnotationConfigContextLoaderUtils : Could not detect default configuration classes for test class [org.vaadin.addons.dramafinder.tests.it.TimePickerGetByLabelIT]: TimePickerGetByLabelIT does not declare any static, non-private, non-final, nested classes annotated with @Configuration.
2026-09-18T12:11:28.833Z INFO 2720100 --- [Pool-1-worker-1] t.c.s.AnnotationConfigContextLoaderUtils : Could not detect default configuration classes for test class [org.vaadin.addons.dramafinder.tests.it.SpringPlaywrightIT]: SpringPlaywrightIT does not declare any static, non-private, non-final, nested classes annotated with @Configuration.
2026-09-18T12:11:28.833Z INFO 2720100 --- [Pool-1-worker-1] t.c.s.AnnotationConfigContextLoaderUtils : Could not detect default configuration classes for test class [org.vaadin.addons.dramafinder.AbstractBasePlaywrightIT]: AbstractBasePlaywrightIT does not declare any static, non-private, non-final, nested classes annotated with @Configuration.
2026-09-18T12:11:28.833Z INFO 2720100 --- [Pool-1-worker-1] .b.t.c.SpringBootTestContextBootstrapper : Found @SpringBootConfiguration org.vaadin.addons.dramafinder.tests.TestServer for test class org.vaadin.addons.dramafinder.tests.it.TimePickerGetByLabelIT
[INFO] Tests run: 3, Failures: 0, Errors: 0, Skipped: 0, Time elapsed: 5.125 s -- in org.vaadin.addons.dramafinder.tests.it.TimePickerGetByLabelIT
[INFO] Running org.vaadin.addons.dramafinder.tests.it.GridBasicViewIT
2026-09-18T12:11:33.969Z INFO 2720100 --- [Pool-1-worker-1] t.c.s.AnnotationConfigContextLoaderUtils : Could not detect default configuration classes for test class [org.vaadin.addons.dramafinder.tests.it.GridBasicViewIT]: GridBasicViewIT does not declare any static, non-private, non-final, nested classes annotated with @Configuration.
2026-09-18T12:11:33.970Z INFO 2720100 --- [Pool-1-worker-1] .b.t.c.SpringBootTestContextBootstrapper : Found @SpringBootConfiguration org.vaadin.addons.dramafinder.tests.TestServer for test class org.vaadin.addons.dramafinder.tests.it.GridBasicViewIT
2026-09-18T12:11:33.977Z INFO 2720100 --- [Pool-1-worker-1] t.c.s.AnnotationConfigContextLoaderUtils : Could not detect default configuration classes for test class [org.vaadin.addons.dramafinder.tests.it.GridBasicViewIT]: GridBasicViewIT does not declare any static, non-private, non-final, nested classes annotated with @Configuration.
2026-09-18T12:11:33.982Z INFO 2720100 --- [Pool-1-worker-1] t.c.s.AnnotationConfigContextLoaderUtils : Could not detect default configuration classes for test class [org.vaadin.addons.dramafinder.tests.it.SpringPlaywrightIT]: SpringPlaywrightIT does not declare any static, non-private, non-final, nested classes annotated with @Configuration.
2026-09-18T12:11:33.983Z INFO 2720100 --- [Pool-1-worker-1] t.c.s.AnnotationConfigContextLoaderUtils : Could not detect default configuration classes for test class [org.vaadin.addons.dramafinder.AbstractBasePlaywrightIT]: AbstractBasePlaywrightIT does not declare any static, non-private, non-final, nested classes annotated with @Configuration.
2026-09-18T12:11:33.983Z INFO 2720100 --- [Pool-1-worker-1] .b.t.c.SpringBootTestContextBootstrapper : Found @SpringBootConfiguration org.vaadin.addons.dramafinder.tests.TestServer for test class org.vaadin.addons.dramafinder.tests.it.GridBasicViewIT
[INFO] Tests run: 5, Failures: 0, Errors: 0, Skipped: 0, Time elapsed: 11.70 s -- in org.vaadin.addons.dramafinder.tests.it.DialogViewIT
[INFO] Running org.vaadin.addons.dramafinder.tests.it.SideNavigationElementViewIT
2026-09-18T12:11:34.540Z INFO 2720100 --- [Pool-1-worker-2] t.c.s.AnnotationConfigContextLoaderUtils : Could not detect default configuration classes for test class [org.vaadin.addons.dramafinder.tests.it.SideNavigationElementViewIT]: SideNavigationElementViewIT does not declare any static, non-private, non-final, nested classes annotated with @Configuration.
2026-09-18T12:11:34.545Z INFO 2720100 --- [Pool-1-worker-2] .b.t.c.SpringBootTestContextBootstrapper : Found @SpringBootConfiguration org.vaadin.addons.dramafinder.tests.TestServer for test class org.vaadin.addons.dramafinder.tests.it.SideNavigationElementViewIT
2026-09-18T12:11:34.548Z INFO 2720100 --- [Pool-1-worker-2] t.c.s.AnnotationConfigContextLoaderUtils : Could not detect default configuration classes for test class [org.vaadin.addons.dramafinder.tests.it.SideNavigationElementViewIT]: SideNavigationElementViewIT does not declare any static, non-private, non-final, nested classes annotated with @Configuration.
2026-09-18T12:11:34.549Z INFO 2720100 --- [Pool-1-worker-2] t.c.s.AnnotationConfigContextLoaderUtils : Could not detect default configuration classes for test class [org.vaadin.addons.dramafinder.tests.it.SpringPlaywrightIT]: SpringPlaywrightIT does not declare any static, non-private, non-final, nested classes annotated with @Configuration.
2026-09-18T12:11:34.551Z INFO 2720100 --- [Pool-1-worker-2] t.c.s.AnnotationConfigContextLoaderUtils : Could not detect default configuration classes for test class [org.vaadin.addons.dramafinder.AbstractBasePlaywrightIT]: AbstractBasePlaywrightIT does not declare any static, non-private, non-final, nested classes annotated with @Configuration.
2026-09-18T12:11:34.551Z INFO 2720100 --- [Pool-1-worker-2] .b.t.c.SpringBootTestContextBootstrapper : Found @SpringBootConfiguration org.vaadin.addons.dramafinder.tests.TestServer for test class org.vaadin.addons.dramafinder.tests.it.SideNavigationElementViewIT
[INFO] Tests run: 8, Failures: 0, Errors: 0, Skipped: 0, Time elapsed: 14.27 s -- in org.vaadin.addons.dramafinder.tests.it.SideNavigationElementViewIT
[INFO] Running org.vaadin.addons.dramafinder.tests.it.AvatarViewIT
2026-09-18T12:11:48.808Z INFO 2720100 --- [Pool-1-worker-2] t.c.s.AnnotationConfigContextLoaderUtils : Could not detect default configuration classes for test class [org.vaadin.addons.dramafinder.tests.it.AvatarViewIT]: AvatarViewIT does not declare any static, non-private, non-final, nested classes annotated with @Configuration.
2026-09-18T12:11:48.810Z INFO 2720100 --- [Pool-1-worker-2] .b.t.c.SpringBootTestContextBootstrapper : Found @SpringBootConfiguration org.vaadin.addons.dramafinder.tests.TestServer for test class org.vaadin.addons.dramafinder.tests.it.AvatarViewIT
2026-09-18T12:11:48.810Z INFO 2720100 --- [Pool-1-worker-2] t.c.s.AnnotationConfigContextLoaderUtils : Could not detect default configuration classes for test class [org.vaadin.addons.dramafinder.tests.it.AvatarViewIT]: AvatarViewIT does not declare any static, non-private, non-final, nested classes annotated with @Configuration.
2026-09-18T12:11:48.810Z INFO 2720100 --- [Pool-1-worker-2] t.c.s.AnnotationConfigContextLoaderUtils : Could not detect default configuration classes for test class [org.vaadin.addons.dramafinder.tests.it.SpringPlaywrightIT]: SpringPlaywrightIT does not declare any static, non-private, non-final, nested classes annotated with @Configuration.
2026-09-18T12:11:48.810Z INFO 2720100 --- [Pool-1-worker-2] t.c.s.AnnotationConfigContextLoaderUtils : Could not detect default configuration classes for test class [org.vaadin.addons.dramafinder.AbstractBasePlaywrightIT]: AbstractBasePlaywrightIT does not declare any static, non-private, non-final, nested classes annotated with @Configuration.
2026-09-18T12:11:48.811Z INFO 2720100 --- [Pool-1-worker-2] .b.t.c.SpringBootTestContextBootstrapper : Found @SpringBootConfiguration org.vaadin.addons.dramafinder.tests.TestServer for test class org.vaadin.addons.dramafinder.tests.it.AvatarViewIT
[INFO] Tests run: 16, Failures: 0, Errors: 0, Skipped: 0, Time elapsed: 31.14 s -- in org.vaadin.addons.dramafinder.tests.it.TreeGridBasicViewIT
[INFO] Running org.vaadin.addons.dramafinder.tests.it.DateTimePickerGetByLabelIT
2026-09-18T12:11:59.137Z INFO 2720100 --- [Pool-1-worker-3] t.c.s.AnnotationConfigContextLoaderUtils : Could not detect default configuration classes for test class [org.vaadin.addons.dramafinder.tests.it.DateTimePickerGetByLabelIT]: DateTimePickerGetByLabelIT does not declare any static, non-private, non-final, nested classes annotated with @Configuration.
2026-09-18T12:11:59.143Z INFO 2720100 --- [Pool-1-worker-3] .b.t.c.SpringBootTestContextBootstrapper : Found @SpringBootConfiguration org.vaadin.addons.dramafinder.tests.TestServer for test class org.vaadin.addons.dramafinder.tests.it.DateTimePickerGetByLabelIT
2026-09-18T12:11:59.145Z INFO 2720100 --- [Pool-1-worker-3] t.c.s.AnnotationConfigContextLoaderUtils : Could not detect default configuration classes for test class [org.vaadin.addons.dramafinder.tests.it.DateTimePickerGetByLabelIT]: DateTimePickerGetByLabelIT does not declare any static, non-private, non-final, nested classes annotated with @Configuration.
2026-09-18T12:11:59.145Z INFO 2720100 --- [Pool-1-worker-3] t.c.s.AnnotationConfigContextLoaderUtils : Could not detect default configuration classes for test class [org.vaadin.addons.dramafinder.tests.it.SpringPlaywrightIT]: SpringPlaywrightIT does not declare any static, non-private, non-final, nested classes annotated with @Configuration.
2026-09-18T12:11:59.163Z INFO 2720100 --- [Pool-1-worker-3] t.c.s.AnnotationConfigContextLoaderUtils : Could not detect default configuration classes for test class [org.vaadin.addons.dramafinder.AbstractBasePlaywrightIT]: AbstractBasePlaywrightIT does not declare any static, non-private, non-final, nested classes annotated with @Configuration.
2026-09-18T12:11:59.165Z INFO 2720100 --- [Pool-1-worker-3] .b.t.c.SpringBootTestContextBootstrapper : Found @SpringBootConfiguration org.vaadin.addons.dramafinder.tests.TestServer for test class org.vaadin.addons.dramafinder.tests.it.DateTimePickerGetByLabelIT
[INFO] Tests run: 3, Failures: 0, Errors: 0, Skipped: 0, Time elapsed: 6.880 s -- in org.vaadin.addons.dramafinder.tests.it.DateTimePickerGetByLabelIT
[INFO] Running org.vaadin.addons.dramafinder.tests.it.SliderViewIT
2026-09-18T12:12:06.018Z INFO 2720100 --- [Pool-1-worker-3] t.c.s.AnnotationConfigContextLoaderUtils : Could not detect default configuration classes for test class [org.vaadin.addons.dramafinder.tests.it.SliderViewIT]: SliderViewIT does not declare any static, non-private, non-final, nested classes annotated with @Configuration.
2026-09-18T12:12:06.022Z INFO 2720100 --- [Pool-1-worker-3] .b.t.c.SpringBootTestContextBootstrapper : Found @SpringBootConfiguration org.vaadin.addons.dramafinder.tests.TestServer for test class org.vaadin.addons.dramafinder.tests.it.SliderViewIT
2026-09-18T12:12:06.025Z INFO 2720100 --- [Pool-1-worker-3] t.c.s.AnnotationConfigContextLoaderUtils : Could not detect default configuration classes for test class [org.vaadin.addons.dramafinder.tests.it.SliderViewIT]: SliderViewIT does not declare any static, non-private, non-final, nested classes annotated with @Configuration.
2026-09-18T12:12:06.025Z INFO 2720100 --- [Pool-1-worker-3] t.c.s.AnnotationConfigContextLoaderUtils : Could not detect default configuration classes for test class [org.vaadin.addons.dramafinder.tests.it.SpringPlaywrightIT]: SpringPlaywrightIT does not declare any static, non-private, non-final, nested classes annotated with @Configuration.
2026-09-18T12:12:06.025Z INFO 2720100 --- [Pool-1-worker-3] t.c.s.AnnotationConfigContextLoaderUtils : Could not detect default configuration classes for test class [org.vaadin.addons.dramafinder.AbstractBasePlaywrightIT]: AbstractBasePlaywrightIT does not declare any static, non-private, non-final, nested classes annotated with @Configuration.
2026-09-18T12:12:06.026Z INFO 2720100 --- [Pool-1-worker-3] .b.t.c.SpringBootTestContextBootstrapper : Found @SpringBootConfiguration org.vaadin.addons.dramafinder.tests.TestServer for test class org.vaadin.addons.dramafinder.tests.it.SliderViewIT
[INFO] Tests run: 14, Failures: 0, Errors: 0, Skipped: 0, Time elapsed: 24.15 s -- in org.vaadin.addons.dramafinder.tests.it.AvatarViewIT
[INFO] Running org.vaadin.addons.dramafinder.tests.it.BadgeViewIT
2026-09-18T12:12:12.965Z INFO 2720100 --- [Pool-1-worker-2] t.c.s.AnnotationConfigContextLoaderUtils : Could not detect default configuration classes for test class [org.vaadin.addons.dramafinder.tests.it.BadgeViewIT]: BadgeViewIT does not declare any static, non-private, non-final, nested classes annotated with @Configuration.
2026-09-18T12:12:12.968Z INFO 2720100 --- [Pool-1-worker-2] .b.t.c.SpringBootTestContextBootstrapper : Found @SpringBootConfiguration org.vaadin.addons.dramafinder.tests.TestServer for test class org.vaadin.addons.dramafinder.tests.it.BadgeViewIT
2026-09-18T12:12:12.968Z INFO 2720100 --- [Pool-1-worker-2] t.c.s.AnnotationConfigContextLoaderUtils : Could not detect default configuration classes for test class [org.vaadin.addons.dramafinder.tests.it.BadgeViewIT]: BadgeViewIT does not declare any static, non-private, non-final, nested classes annotated with @Configuration.
2026-09-18T12:12:12.969Z INFO 2720100 --- [Pool-1-worker-2] t.c.s.AnnotationConfigContextLoaderUtils : Could not detect default configuration classes for test class [org.vaadin.addons.dramafinder.tests.it.SpringPlaywrightIT]: SpringPlaywrightIT does not declare any static, non-private, non-final, nested classes annotated with @Configuration.
2026-09-18T12:12:12.969Z INFO 2720100 --- [Pool-1-worker-2] t.c.s.AnnotationConfigContextLoaderUtils : Could not detect default configuration classes for test class [org.vaadin.addons.dramafinder.AbstractBasePlaywrightIT]: AbstractBasePlaywrightIT does not declare any static, non-private, non-final, nested classes annotated with @Configuration.
2026-09-18T12:12:12.972Z INFO 2720100 --- [Pool-1-worker-2] .b.t.c.SpringBootTestContextBootstrapper : Found @SpringBootConfiguration org.vaadin.addons.dramafinder.tests.TestServer for test class org.vaadin.addons.dramafinder.tests.it.BadgeViewIT
[INFO] Tests run: 9, Failures: 0, Errors: 0, Skipped: 0, Time elapsed: 16.77 s -- in org.vaadin.addons.dramafinder.tests.it.SliderViewIT
[INFO] Running org.vaadin.addons.dramafinder.tests.it.GridSortingViewIT
2026-09-18T12:12:22.787Z INFO 2720100 --- [Pool-1-worker-3] t.c.s.AnnotationConfigContextLoaderUtils : Could not detect default configuration classes for test class [org.vaadin.addons.dramafinder.tests.it.GridSortingViewIT]: GridSortingViewIT does not declare any static, non-private, non-final, nested classes annotated with @Configuration.
2026-09-18T12:12:22.788Z INFO 2720100 --- [Pool-1-worker-3] .b.t.c.SpringBootTestContextBootstrapper : Found @SpringBootConfiguration org.vaadin.addons.dramafinder.tests.TestServer for test class org.vaadin.addons.dramafinder.tests.it.GridSortingViewIT
2026-09-18T12:12:22.789Z INFO 2720100 --- [Pool-1-worker-3] t.c.s.AnnotationConfigContextLoaderUtils : Could not detect default configuration classes for test class [org.vaadin.addons.dramafinder.tests.it.GridSortingViewIT]: GridSortingViewIT does not declare any static, non-private, non-final, nested classes annotated with @Configuration.
2026-09-18T12:12:22.789Z INFO 2720100 --- [Pool-1-worker-3] t.c.s.AnnotationConfigContextLoaderUtils : Could not detect default configuration classes for test class [org.vaadin.addons.dramafinder.tests.it.SpringPlaywrightIT]: SpringPlaywrightIT does not declare any static, non-private, non-final, nested classes annotated with @Configuration.
2026-09-18T12:12:22.789Z INFO 2720100 --- [Pool-1-worker-3] t.c.s.AnnotationConfigContextLoaderUtils : Could not detect default configuration classes for test class [org.vaadin.addons.dramafinder.AbstractBasePlaywrightIT]: AbstractBasePlaywrightIT does not declare any static, non-private, non-final, nested classes annotated with @Configuration.
2026-09-18T12:12:22.790Z INFO 2720100 --- [Pool-1-worker-3] .b.t.c.SpringBootTestContextBootstrapper : Found @SpringBootConfiguration org.vaadin.addons.dramafinder.tests.TestServer for test class org.vaadin.addons.dramafinder.tests.it.GridSortingViewIT
[INFO] Tests run: 6, Failures: 0, Errors: 0, Skipped: 0, Time elapsed: 11.88 s -- in org.vaadin.addons.dramafinder.tests.it.GridSortingViewIT
[INFO] Running org.vaadin.addons.dramafinder.tests.it.AmbiguousLabelIT
2026-09-18T12:12:34.674Z INFO 2720100 --- [Pool-1-worker-3] t.c.s.AnnotationConfigContextLoaderUtils : Could not detect default configuration classes for test class [org.vaadin.addons.dramafinder.tests.it.AmbiguousLabelIT]: AmbiguousLabelIT does not declare any static, non-private, non-final, nested classes annotated with @Configuration.
2026-09-18T12:12:34.676Z INFO 2720100 --- [Pool-1-worker-3] .b.t.c.SpringBootTestContextBootstrapper : Found @SpringBootConfiguration org.vaadin.addons.dramafinder.tests.TestServer for test class org.vaadin.addons.dramafinder.tests.it.AmbiguousLabelIT
2026-09-18T12:12:34.676Z INFO 2720100 --- [Pool-1-worker-3] t.c.s.AnnotationConfigContextLoaderUtils : Could not detect default configuration classes for test class [org.vaadin.addons.dramafinder.tests.it.AmbiguousLabelIT]: AmbiguousLabelIT does not declare any static, non-private, non-final, nested classes annotated with @Configuration.
2026-09-18T12:12:34.677Z INFO 2720100 --- [Pool-1-worker-3] t.c.s.AnnotationConfigContextLoaderUtils : Could not detect default configuration classes for test class [org.vaadin.addons.dramafinder.tests.it.SpringPlaywrightIT]: SpringPlaywrightIT does not declare any static, non-private, non-final, nested classes annotated with @Configuration.
2026-09-18T12:12:34.677Z INFO 2720100 --- [Pool-1-worker-3] t.c.s.AnnotationConfigContextLoaderUtils : Could not detect default configuration classes for test class [org.vaadin.addons.dramafinder.AbstractBasePlaywrightIT]: AbstractBasePlaywrightIT does not declare any static, non-private, non-final, nested classes annotated with @Configuration.
2026-09-18T12:12:34.677Z INFO 2720100 --- [Pool-1-worker-3] .b.t.c.SpringBootTestContextBootstrapper : Found @SpringBootConfiguration org.vaadin.addons.dramafinder.tests.TestServer for test class org.vaadin.addons.dramafinder.tests.it.AmbiguousLabelIT
[INFO] Tests run: 12, Failures: 0, Errors: 0, Skipped: 0, Time elapsed: 20.79 s -- in org.vaadin.addons.dramafinder.tests.it.AmbiguousLabelIT
[INFO] Running org.vaadin.addons.dramafinder.tests.it.CheckboxGroupViewIT
2026-09-18T12:12:55.468Z INFO 2720100 --- [Pool-1-worker-3] t.c.s.AnnotationConfigContextLoaderUtils : Could not detect default configuration classes for test class [org.vaadin.addons.dramafinder.tests.it.CheckboxGroupViewIT]: CheckboxGroupViewIT does not declare any static, non-private, non-final, nested classes annotated with @Configuration.
2026-09-18T12:12:55.473Z INFO 2720100 --- [Pool-1-worker-3] .b.t.c.SpringBootTestContextBootstrapper : Found @SpringBootConfiguration org.vaadin.addons.dramafinder.tests.TestServer for test class org.vaadin.addons.dramafinder.tests.it.CheckboxGroupViewIT
2026-09-18T12:12:55.474Z INFO 2720100 --- [Pool-1-worker-3] t.c.s.AnnotationConfigContextLoaderUtils : Could not detect default configuration classes for test class [org.vaadin.addons.dramafinder.tests.it.CheckboxGroupViewIT]: CheckboxGroupViewIT does not declare any static, non-private, non-final, nested classes annotated with @Configuration.
2026-09-18T12:12:55.474Z INFO 2720100 --- [Pool-1-worker-3] t.c.s.AnnotationConfigContextLoaderUtils : Could not detect default configuration classes for test class [org.vaadin.addons.dramafinder.tests.it.SpringPlaywrightIT]: SpringPlaywrightIT does not declare any static, non-private, non-final, nested classes annotated with @Configuration.
2026-09-18T12:12:55.474Z INFO 2720100 --- [Pool-1-worker-3] t.c.s.AnnotationConfigContextLoaderUtils : Could not detect default configuration classes for test class [org.vaadin.addons.dramafinder.AbstractBasePlaywrightIT]: AbstractBasePlaywrightIT does not declare any static, non-private, non-final, nested classes annotated with @Configuration.
2026-09-18T12:12:55.481Z INFO 2720100 --- [Pool-1-worker-3] .b.t.c.SpringBootTestContextBootstrapper : Found @SpringBootConfiguration org.vaadin.addons.dramafinder.tests.TestServer for test class org.vaadin.addons.dramafinder.tests.it.CheckboxGroupViewIT
[INFO] Tests run: 25, Failures: 0, Errors: 0, Skipped: 0, Time elapsed: 43.97 s -- in org.vaadin.addons.dramafinder.tests.it.BadgeViewIT
[INFO] Running org.vaadin.addons.dramafinder.tests.it.TreeGridSelectionViewIT
2026-09-18T12:12:56.935Z INFO 2720100 --- [Pool-1-worker-2] t.c.s.AnnotationConfigContextLoaderUtils : Could not detect default configuration classes for test class [org.vaadin.addons.dramafinder.tests.it.TreeGridSelectionViewIT]: TreeGridSelectionViewIT does not declare any static, non-private, non-final, nested classes annotated with @Configuration.
2026-09-18T12:12:56.940Z INFO 2720100 --- [Pool-1-worker-2] .b.t.c.SpringBootTestContextBootstrapper : Found @SpringBootConfiguration org.vaadin.addons.dramafinder.tests.TestServer for test class org.vaadin.addons.dramafinder.tests.it.TreeGridSelectionViewIT
2026-09-18T12:12:56.942Z INFO 2720100 --- [Pool-1-worker-2] t.c.s.AnnotationConfigContextLoaderUtils : Could not detect default configuration classes for test class [org.vaadin.addons.dramafinder.tests.it.TreeGridSelectionViewIT]: TreeGridSelectionViewIT does not declare any static, non-private, non-final, nested classes annotated with @Configuration.
2026-09-18T12:12:56.942Z INFO 2720100 --- [Pool-1-worker-2] t.c.s.AnnotationConfigContextLoaderUtils : Could not detect default configuration classes for test class [org.vaadin.addons.dramafinder.tests.it.SpringPlaywrightIT]: SpringPlaywrightIT does not declare any static, non-private, non-final, nested classes annotated with @Configuration.
2026-09-18T12:12:56.942Z INFO 2720100 --- [Pool-1-worker-2] t.c.s.AnnotationConfigContextLoaderUtils : Could not detect default configuration classes for test class [org.vaadin.addons.dramafinder.AbstractBasePlaywrightIT]: AbstractBasePlaywrightIT does not declare any static, non-private, non-final, nested classes annotated with @Configuration.
2026-09-18T12:12:56.943Z INFO 2720100 --- [Pool-1-worker-2] .b.t.c.SpringBootTestContextBootstrapper : Found @SpringBootConfiguration org.vaadin.addons.dramafinder.tests.TestServer for test class org.vaadin.addons.dramafinder.tests.it.TreeGridSelectionViewIT
[INFO] Tests run: 12, Failures: 0, Errors: 0, Skipped: 0, Time elapsed: 20.74 s -- in org.vaadin.addons.dramafinder.tests.it.CheckboxGroupViewIT
[INFO] Running org.vaadin.addons.dramafinder.tests.it.GridLitRendererViewIT
2026-09-18T12:13:16.202Z INFO 2720100 --- [Pool-1-worker-3] t.c.s.AnnotationConfigContextLoaderUtils : Could not detect default configuration classes for test class [org.vaadin.addons.dramafinder.tests.it.GridLitRendererViewIT]: GridLitRendererViewIT does not declare any static, non-private, non-final, nested classes annotated with @Configuration.
2026-09-18T12:13:16.210Z INFO 2720100 --- [Pool-1-worker-3] .b.t.c.SpringBootTestContextBootstrapper : Found @SpringBootConfiguration org.vaadin.addons.dramafinder.tests.TestServer for test class org.vaadin.addons.dramafinder.tests.it.GridLitRendererViewIT
2026-09-18T12:13:16.213Z INFO 2720100 --- [Pool-1-worker-3] t.c.s.AnnotationConfigContextLoaderUtils : Could not detect default configuration classes for test class [org.vaadin.addons.dramafinder.tests.it.GridLitRendererViewIT]: GridLitRendererViewIT does not declare any static, non-private, non-final, nested classes annotated with @Configuration.
2026-09-18T12:13:16.213Z INFO 2720100 --- [Pool-1-worker-3] t.c.s.AnnotationConfigContextLoaderUtils : Could not detect default configuration classes for test class [org.vaadin.addons.dramafinder.tests.it.SpringPlaywrightIT]: SpringPlaywrightIT does not declare any static, non-private, non-final, nested classes annotated with @Configuration.
2026-09-18T12:13:16.213Z INFO 2720100 --- [Pool-1-worker-3] t.c.s.AnnotationConfigContextLoaderUtils : Could not detect default configuration classes for test class [org.vaadin.addons.dramafinder.AbstractBasePlaywrightIT]: AbstractBasePlaywrightIT does not declare any static, non-private, non-final, nested classes annotated with @Configuration.
2026-09-18T12:13:16.214Z INFO 2720100 --- [Pool-1-worker-3] .b.t.c.SpringBootTestContextBootstrapper : Found @SpringBootConfiguration org.vaadin.addons.dramafinder.tests.TestServer for test class org.vaadin.addons.dramafinder.tests.it.GridLitRendererViewIT
[INFO] Tests run: 4, Failures: 0, Errors: 0, Skipped: 0, Time elapsed: 7.051 s -- in org.vaadin.addons.dramafinder.tests.it.GridLitRendererViewIT
[INFO] Running org.vaadin.addons.dramafinder.tests.it.NumberFieldViewIT
2026-09-18T12:13:23.257Z INFO 2720100 --- [Pool-1-worker-3] t.c.s.AnnotationConfigContextLoaderUtils : Could not detect default configuration classes for test class [org.vaadin.addons.dramafinder.tests.it.NumberFieldViewIT]: NumberFieldViewIT does not declare any static, non-private, non-final, nested classes annotated with @Configuration.
2026-09-18T12:13:23.264Z INFO 2720100 --- [Pool-1-worker-3] .b.t.c.SpringBootTestContextBootstrapper : Found @SpringBootConfiguration org.vaadin.addons.dramafinder.tests.TestServer for test class org.vaadin.addons.dramafinder.tests.it.NumberFieldViewIT
2026-09-18T12:13:23.268Z INFO 2720100 --- [Pool-1-worker-3] t.c.s.AnnotationConfigContextLoaderUtils : Could not detect default configuration classes for test class [org.vaadin.addons.dramafinder.tests.it.NumberFieldViewIT]: NumberFieldViewIT does not declare any static, non-private, non-final, nested classes annotated with @Configuration.
2026-09-18T12:13:23.268Z INFO 2720100 --- [Pool-1-worker-3] t.c.s.AnnotationConfigContextLoaderUtils : Could not detect default configuration classes for test class [org.vaadin.addons.dramafinder.tests.it.SpringPlaywrightIT]: SpringPlaywrightIT does not declare any static, non-private, non-final, nested classes annotated with @Configuration.
2026-09-18T12:13:23.268Z INFO 2720100 --- [Pool-1-worker-3] t.c.s.AnnotationConfigContextLoaderUtils : Could not detect default configuration classes for test class [org.vaadin.addons.dramafinder.AbstractBasePlaywrightIT]: AbstractBasePlaywrightIT does not declare any static, non-private, non-final, nested classes annotated with @Configuration.
2026-09-18T12:13:23.269Z INFO 2720100 --- [Pool-1-worker-3] .b.t.c.SpringBootTestContextBootstrapper : Found @SpringBootConfiguration org.vaadin.addons.dramafinder.tests.TestServer for test class org.vaadin.addons.dramafinder.tests.it.NumberFieldViewIT
[INFO] Tests run: 4, Failures: 0, Errors: 0, Skipped: 0, Time elapsed: 6.430 s -- in org.vaadin.addons.dramafinder.tests.it.NumberFieldViewIT
[INFO] Running org.vaadin.addons.dramafinder.tests.it.FormLayoutViewIT
2026-09-18T12:13:29.690Z INFO 2720100 --- [Pool-1-worker-3] t.c.s.AnnotationConfigContextLoaderUtils : Could not detect default configuration classes for test class [org.vaadin.addons.dramafinder.tests.it.FormLayoutViewIT]: FormLayoutViewIT does not declare any static, non-private, non-final, nested classes annotated with @Configuration.
2026-09-18T12:13:29.699Z INFO 2720100 --- [Pool-1-worker-3] .b.t.c.SpringBootTestContextBootstrapper : Found @SpringBootConfiguration org.vaadin.addons.dramafinder.tests.TestServer for test class org.vaadin.addons.dramafinder.tests.it.FormLayoutViewIT
2026-09-18T12:13:29.700Z INFO 2720100 --- [Pool-1-worker-3] t.c.s.AnnotationConfigContextLoaderUtils : Could not detect default configuration classes for test class [org.vaadin.addons.dramafinder.tests.it.FormLayoutViewIT]: FormLayoutViewIT does not declare any static, non-private, non-final, nested classes annotated with @Configuration.
2026-09-18T12:13:29.704Z INFO 2720100 --- [Pool-1-worker-3] t.c.s.AnnotationConfigContextLoaderUtils : Could not detect default configuration classes for test class [org.vaadin.addons.dramafinder.tests.it.SpringPlaywrightIT]: SpringPlaywrightIT does not declare any static, non-private, non-final, nested classes annotated with @Configuration.
2026-09-18T12:13:29.704Z INFO 2720100 --- [Pool-1-worker-3] t.c.s.AnnotationConfigContextLoaderUtils : Could not detect default configuration classes for test class [org.vaadin.addons.dramafinder.AbstractBasePlaywrightIT]: AbstractBasePlaywrightIT does not declare any static, non-private, non-final, nested classes annotated with @Configuration.
2026-09-18T12:13:29.705Z INFO 2720100 --- [Pool-1-worker-3] .b.t.c.SpringBootTestContextBootstrapper : Found @SpringBootConfiguration org.vaadin.addons.dramafinder.tests.TestServer for test class org.vaadin.addons.dramafinder.tests.it.FormLayoutViewIT
[INFO] Tests run: 10, Failures: 0, Errors: 0, Skipped: 0, Time elapsed: 17.34 s -- in org.vaadin.addons.dramafinder.tests.it.FormLayoutViewIT
[INFO] Running org.vaadin.addons.dramafinder.tests.it.AvatarGroupViewIT
2026-09-18T12:13:47.040Z INFO 2720100 --- [Pool-1-worker-3] t.c.s.AnnotationConfigContextLoaderUtils : Could not detect default configuration classes for test class [org.vaadin.addons.dramafinder.tests.it.AvatarGroupViewIT]: AvatarGroupViewIT does not declare any static, non-private, non-final, nested classes annotated with @Configuration.
2026-09-18T12:13:47.042Z INFO 2720100 --- [Pool-1-worker-3] .b.t.c.SpringBootTestContextBootstrapper : Found @SpringBootConfiguration org.vaadin.addons.dramafinder.tests.TestServer for test class org.vaadin.addons.dramafinder.tests.it.AvatarGroupViewIT
2026-09-18T12:13:47.043Z INFO 2720100 --- [Pool-1-worker-3] t.c.s.AnnotationConfigContextLoaderUtils : Could not detect default configuration classes for test class [org.vaadin.addons.dramafinder.tests.it.AvatarGroupViewIT]: AvatarGroupViewIT does not declare any static, non-private, non-final, nested classes annotated with @Configuration.
2026-09-18T12:13:47.043Z INFO 2720100 --- [Pool-1-worker-3] t.c.s.AnnotationConfigContextLoaderUtils : Could not detect default configuration classes for test class [org.vaadin.addons.dramafinder.tests.it.SpringPlaywrightIT]: SpringPlaywrightIT does not declare any static, non-private, non-final, nested classes annotated with @Configuration.
2026-09-18T12:13:47.043Z INFO 2720100 --- [Pool-1-worker-3] t.c.s.AnnotationConfigContextLoaderUtils : Could not detect default configuration classes for test class [org.vaadin.addons.dramafinder.AbstractBasePlaywrightIT]: AbstractBasePlaywrightIT does not declare any static, non-private, non-final, nested classes annotated with @Configuration.
2026-09-18T12:13:47.044Z INFO 2720100 --- [Pool-1-worker-3] .b.t.c.SpringBootTestContextBootstrapper : Found @SpringBootConfiguration org.vaadin.addons.dramafinder.tests.TestServer for test class org.vaadin.addons.dramafinder.tests.it.AvatarGroupViewIT
[INFO] Tests run: 31, Failures: 0, Errors: 0, Skipped: 0, Time elapsed: 69.36 s -- in org.vaadin.addons.dramafinder.tests.it.TreeGridSelectionViewIT
[INFO] Tests run: 20, Failures: 0, Errors: 0, Skipped: 0, Time elapsed: 28.52 s -- in org.vaadin.addons.dramafinder.tests.it.AvatarGroupViewIT
[INFO] Tests run: 38, Failures: 0, Errors: 0, Skipped: 0, Time elapsed: 211.3 s -- in org.vaadin.addons.dramafinder.tests.it.GridBasicViewIT
[INFO]
[INFO] Results:
[INFO]
[ERROR] Failures:
[ERROR] ButtonViewIT.testHasThemeVariant:50 Locator expected to have attribute 'theme'
Expected: small primary
Received: primary small
Call log:
- Assert "hasAttribute" with timeout 5000ms
- waiting for getByRole(AriaRole.BUTTON, new Page.GetByRoleOptions().setName("Combined Variants Button")).and(locator("vaadin-button"))
8 × locator resolved to Combined Variants Button
- unexpected value "primary small"
[INFO]
[ERROR] Tests run: 717, Failures: 1, Errors: 0, Skipped: 0
[INFO]
[WARNING] Corrupted channel by directly writing to native stream in forked JVM 1. See FAQ web page and the dump file /home/ghrunner/actions-runner/_work/vaadin-ecosystem-build/vaadin-ecosystem-build/work/dramafinder/target/failsafe-reports/2026-09-18T12-05-29_863-jvmRun1.dumpstream
[INFO]
[INFO] --- failsafe:3.5.4:verify (default) @ dramafinder ---
[INFO] ------------------------------------------------------------------------
[INFO] BUILD FAILURE
[INFO] ------------------------------------------------------------------------
[INFO] Total time: 09:46 min
[INFO] Finished at: 2026-09-18T12:15:05Z
[INFO] ------------------------------------------------------------------------
[ERROR] Failed to execute goal org.apache.maven.plugins:maven-failsafe-plugin:3.5.4:verify (default) on project dramafinder: There are test failures.
[ERROR]
[ERROR] See /home/ghrunner/actions-runner/_work/vaadin-ecosystem-build/vaadin-ecosystem-build/work/dramafinder/target/failsafe-reports for the individual test results.
[ERROR] See dump files (if any exist) [date].dump, [date]-jvmRun[N].dump and [date].dumpstream.
[ERROR] -> [Help 1]
[ERROR]
[ERROR] To see the full stack trace of the errors, re-run Maven with the -e switch.
[ERROR] Re-run Maven using the -X switch to enable full debug logging.
[ERROR]
[ERROR] For more information about the errors and possible solutions, please read the following articles:
[ERROR] [Help 1] http://cwiki.apache.org/confluence/display/MAVEN/MojoFailureException