$ mvn clean verify -B --no-transfer-progress --settings /home/ghrunner/actions-runner/_work/vaadin-ecosystem-build/vaadin-ecosystem-build/settings.xml
[1;33mjava 25-tem is already installed.[0m
[1;32mUsing java version 25-tem in this shell.[0m
[INFO] Scanning for projects...
[WARNING]
[WARNING] Some problems were encountered while building the effective model for org.parttio:hugerte-for-flow:jar:2.1.1-SNAPSHOT
[WARNING] 'build.plugins.plugin.version' for org.springframework.boot:spring-boot-maven-plugin is missing. @ line 142, column 21
[WARNING]
[WARNING] It is highly recommended to fix these problems because they threaten the stability of your build.
[WARNING]
[WARNING] For this reason, future Maven versions might no longer support building such malformed projects.
[WARNING]
[INFO]
[INFO] --------------------< org.parttio:hugerte-for-flow >--------------------
[INFO] Building HugeRTE for Flow 2.1.1-SNAPSHOT
[INFO] from pom.xml
[INFO] --------------------------------[ jar ]---------------------------------
[INFO]
[INFO] --- clean:3.2.0:clean (default-clean) @ hugerte-for-flow ---
[INFO] Deleting /home/ghrunner/actions-runner/_work/vaadin-ecosystem-build/vaadin-ecosystem-build/work/hugerte-for-flow/target
[INFO]
[INFO] --- resources:3.3.1:resources (default-resources) @ hugerte-for-flow ---
[INFO] Copying 192 resources from src/main/resources to target/classes
[INFO]
[INFO] --- vaadin:25.1.5:prepare-frontend (default) @ hugerte-for-flow ---
[INFO] ClassFinder initialized: 65 urls, 3023 classes scanned, 30 annotation types cached, 605 subtype relationships cached, took 734ms
[INFO] Visited 101 classes. Took 109 ms.
[INFO] Copying frontend resources from jar files ...
[INFO] Visited 67 resources. Took 93 ms.
[INFO]
[INFO] --- compiler:3.14.1:compile (default-compile) @ hugerte-for-flow ---
[INFO] Recompiling the module because of changed source code.
[INFO] Compiling 11 source files with javac [debug release 21] to target/classes
WARNING: A terminally deprecated method in sun.misc.Unsafe has been called
WARNING: sun.misc.Unsafe::objectFieldOffset has been called by lombok.permit.Permit
WARNING: Please consider reporting this to the maintainers of class lombok.permit.Permit
WARNING: sun.misc.Unsafe::objectFieldOffset will be removed in a future release
[INFO]
[INFO] --- resources:3.3.1:testResources (default-testResources) @ hugerte-for-flow ---
[INFO] Copying 2 resources from src/test/resources to target/test-classes
[INFO]
[INFO] --- compiler:3.14.1:testCompile (default-testCompile) @ hugerte-for-flow ---
[INFO] Recompiling the module because of changed dependency.
[INFO] Compiling 38 source files with javac [debug release 21] to target/test-classes
[INFO]
[INFO] --- surefire:3.2.5:test (default-test) @ hugerte-for-flow ---
[INFO] Using auto detected provider org.apache.maven.surefire.junitplatform.JUnitPlatformProvider
[INFO]
[INFO] -------------------------------------------------------
[INFO] T E S T S
[INFO] -------------------------------------------------------
[INFO] Running org.vaadin.hugerte.MopoSmokeTest
21:07:26.916 [main] INFO org.springframework.test.context.support.AnnotationConfigContextLoaderUtils -- Could not detect default configuration classes for test class [org.vaadin.hugerte.MopoSmokeTest]: MopoSmokeTest does not declare any static, non-private, non-final, nested classes annotated with @Configuration.
21:07:27.223 [main] INFO org.springframework.boot.test.context.SpringBootTestContextBootstrapper -- Found @SpringBootConfiguration org.vaadin.hugerte.Application for test class org.vaadin.hugerte.MopoSmokeTest
21:07:27.359 [main] INFO org.springframework.test.context.support.AnnotationConfigContextLoaderUtils -- Could not detect default configuration classes for test class [org.vaadin.hugerte.MopoSmokeTest]: MopoSmokeTest does not declare any static, non-private, non-final, nested classes annotated with @Configuration.
21:07:27.361 [main] INFO org.springframework.boot.test.context.SpringBootTestContextBootstrapper -- Found @SpringBootConfiguration org.vaadin.hugerte.Application for test class org.vaadin.hugerte.MopoSmokeTest
. ____ _ __ _ _
/\\ / ___'_ __ _ _(_)_ __ __ _ \ \ \ \
( ( )\___ | '_ | '_| | '_ \/ _` | \ \ \ \
\\/ ___)| |_)| | | | | || (_| | ) ) ) )
' |____| .__|_| |_|_| |_\__, | / / / /
=========|_|==============|___/=/_/_/_/
:: Spring Boot :: (v4.0.6)
2026-10-07T21:08:02.351Z INFO 681079 --- [ main] org.vaadin.hugerte.MopoSmokeTest : Starting MopoSmokeTest using Java 25 with PID 681079 (started by ghrunner in /home/ghrunner/actions-runner/_work/vaadin-ecosystem-build/vaadin-ecosystem-build/work/hugerte-for-flow)
2026-10-07T21:08:02.357Z INFO 681079 --- [ main] org.vaadin.hugerte.MopoSmokeTest : No active profile set, falling back to 1 default profile: "default"
2026-10-07T21:08:04.577Z INFO 681079 --- [ main] o.s.boot.tomcat.TomcatWebServer : Tomcat initialized with port 0 (http)
2026-10-07T21:08:04.618Z INFO 681079 --- [ main] o.apache.catalina.core.StandardService : Starting service [Tomcat]
2026-10-07T21:08:04.622Z INFO 681079 --- [ main] o.apache.catalina.core.StandardEngine : Starting Servlet engine: [Apache Tomcat/11.0.21]
2026-10-07T21:08:04.736Z INFO 681079 --- [ main] b.w.c.s.WebApplicationContextInitializer : Root WebApplicationContext: initialization completed in 2316 ms
2026-10-07T21:08:10.312Z INFO 681079 --- [ main] c.v.f.s.VaadinServletContextInitializer : Search for subclasses and classes with annotations took 4680 ms
2026-10-07T21:08:10.482Z INFO 681079 --- [ main] c.v.b.d.startup.DevModeStartupListener : Starting dev-mode updaters in /home/ghrunner/actions-runner/_work/vaadin-ecosystem-build/vaadin-ecosystem-build/work/hugerte-for-flow folder.
2026-10-07T21:08:10.593Z INFO 681079 --- [ main] c.v.f.s.f.s.FullDependenciesScanner : Visited 129 classes. Took 57 ms.
2026-10-07T21:08:10.697Z WARN 681079 --- [in-dev-server-1] c.v.f.s.f.AbstractTaskClientGenerator :
**************************************************************************
* TypeScript config file 'tsconfig.json' has been updated to the latest *
* version by Vaadin. Please verify that the updated 'tsconfig.json' *
* file contains configuration needed for your project (add any missing *
* parts from the old file if necessary) and restart the application. *
* Old configuration is stored as a '.bak' file. *
**************************************************************************
2026-10-07T21:08:11.668Z INFO 681079 --- [in-dev-server-1] c.v.f.s.frontend.TaskUpdatePackages : Running `npm install` to resolve and optionally download frontend dependencies. This may take a moment, please stand by...
2026-10-07T21:08:12.110Z INFO 681079 --- [in-dev-server-1] c.v.flow.server.frontend.NodeResolver : Node v24.15.0 is already installed in /home/ghrunner/.vaadin
2026-10-07T21:08:12.292Z INFO 681079 --- [ main] org.atmosphere.cpr.AtmosphereFramework : Installed AtmosphereHandler com.vaadin.flow.server.communication.PushAtmosphereHandler mapped to context-path: /*
2026-10-07T21:08:12.292Z INFO 681079 --- [ main] org.atmosphere.cpr.AtmosphereFramework : Installed the following AtmosphereInterceptor mapped to AtmosphereHandler com.vaadin.flow.server.communication.PushAtmosphereHandler
2026-10-07T21:08:12.340Z INFO 681079 --- [ main] org.atmosphere.cpr.AtmosphereFramework : Atmosphere is using org.atmosphere.util.VoidAnnotationProcessor for processing annotation
2026-10-07T21:08:12.357Z INFO 681079 --- [ main] org.atmosphere.util.ForkJoinPool : Using ForkJoinPool java.util.concurrent.ForkJoinPool. Set the org.atmosphere.cpr.broadcaster.maxAsyncWriteThreads to -1 to fully use its power.
2026-10-07T21:08:12.365Z INFO 681079 --- [ main] org.atmosphere.cpr.AtmosphereFramework : Installed WebSocketProtocol org.atmosphere.websocket.protocol.SimpleHttpProtocol
2026-10-07T21:08:12.375Z INFO 681079 --- [ main] o.a.container.JSR356AsyncSupport : JSR 356 Mapping path /VAADIN/push
2026-10-07T21:08:12.396Z INFO 681079 --- [ main] org.atmosphere.cpr.AtmosphereFramework : Installing Default AtmosphereInterceptors
2026-10-07T21:08:12.398Z INFO 681079 --- [ main] org.atmosphere.cpr.AtmosphereFramework : org.atmosphere.interceptor.CorsInterceptor : CORS Interceptor Support
2026-10-07T21:08:12.398Z INFO 681079 --- [ main] org.atmosphere.cpr.AtmosphereFramework : org.atmosphere.interceptor.CacheHeadersInterceptor : Default Response's Headers Interceptor
2026-10-07T21:08:12.399Z INFO 681079 --- [ main] org.atmosphere.cpr.AtmosphereFramework : org.atmosphere.interceptor.PaddingAtmosphereInterceptor : Browser Padding Interceptor Support
2026-10-07T21:08:12.399Z INFO 681079 --- [ main] org.atmosphere.cpr.AtmosphereFramework : org.atmosphere.interceptor.AndroidAtmosphereInterceptor : Android Interceptor Support
2026-10-07T21:08:12.401Z INFO 681079 --- [ main] org.atmosphere.cpr.AtmosphereFramework : org.atmosphere.interceptor.HeartbeatInterceptor : Heartbeat Interceptor Support
2026-10-07T21:08:12.402Z INFO 681079 --- [ main] org.atmosphere.cpr.AtmosphereFramework : org.atmosphere.interceptor.SSEAtmosphereInterceptor : SSE Interceptor Support
2026-10-07T21:08:12.402Z INFO 681079 --- [ main] org.atmosphere.cpr.AtmosphereFramework : org.atmosphere.interceptor.JSONPAtmosphereInterceptor : JSONP Interceptor Support
2026-10-07T21:08:12.403Z INFO 681079 --- [ main] org.atmosphere.cpr.AtmosphereFramework : org.atmosphere.interceptor.JavaScriptProtocol : Atmosphere JavaScript Protocol
2026-10-07T21:08:12.404Z INFO 681079 --- [ main] org.atmosphere.cpr.AtmosphereFramework : org.atmosphere.interceptor.WebSocketMessageSuspendInterceptor : org.atmosphere.interceptor.WebSocketMessageSuspendInterceptor
2026-10-07T21:08:12.404Z INFO 681079 --- [ main] org.atmosphere.cpr.AtmosphereFramework : org.atmosphere.interceptor.OnDisconnectInterceptor : Browser disconnection detection
2026-10-07T21:08:12.404Z INFO 681079 --- [ main] org.atmosphere.cpr.AtmosphereFramework : org.atmosphere.interceptor.IdleResourceInterceptor : org.atmosphere.interceptor.IdleResourceInterceptor
2026-10-07T21:08:12.404Z INFO 681079 --- [ main] org.atmosphere.cpr.AtmosphereFramework : Set org.atmosphere.cpr.AtmosphereInterceptor.disableDefaults to disable them.
2026-10-07T21:08:12.405Z INFO 681079 --- [ main] org.atmosphere.cpr.AtmosphereFramework : Installed AtmosphereInterceptor CORS Interceptor Support with priority FIRST_BEFORE_DEFAULT
2026-10-07T21:08:12.413Z INFO 681079 --- [ main] org.atmosphere.cpr.AtmosphereFramework : Installed AtmosphereInterceptor Default Response's Headers Interceptor with priority AFTER_DEFAULT
2026-10-07T21:08:12.414Z INFO 681079 --- [ main] org.atmosphere.cpr.AtmosphereFramework : Installed AtmosphereInterceptor Browser Padding Interceptor Support with priority AFTER_DEFAULT
2026-10-07T21:08:12.414Z INFO 681079 --- [ main] org.atmosphere.cpr.AtmosphereFramework : Installed AtmosphereInterceptor Android Interceptor Support with priority AFTER_DEFAULT
2026-10-07T21:08:12.415Z INFO 681079 --- [ main] o.a.interceptor.HeartbeatInterceptor : HeartbeatInterceptor configured with padding value 'X', client frequency 0 seconds and server frequency 60 seconds
2026-10-07T21:08:12.415Z INFO 681079 --- [ main] org.atmosphere.cpr.AtmosphereFramework : Installed AtmosphereInterceptor Heartbeat Interceptor Support with priority AFTER_DEFAULT
2026-10-07T21:08:12.415Z INFO 681079 --- [ main] org.atmosphere.cpr.AtmosphereFramework : Installed AtmosphereInterceptor SSE Interceptor Support with priority AFTER_DEFAULT
2026-10-07T21:08:12.415Z INFO 681079 --- [ main] org.atmosphere.cpr.AtmosphereFramework : Installed AtmosphereInterceptor JSONP Interceptor Support with priority AFTER_DEFAULT
2026-10-07T21:08:12.415Z INFO 681079 --- [ main] org.atmosphere.cpr.AtmosphereFramework : Installed AtmosphereInterceptor Atmosphere JavaScript Protocol with priority AFTER_DEFAULT
2026-10-07T21:08:12.415Z INFO 681079 --- [ main] org.atmosphere.cpr.AtmosphereFramework : Installed AtmosphereInterceptor org.atmosphere.interceptor.WebSocketMessageSuspendInterceptor with priority AFTER_DEFAULT
2026-10-07T21:08:12.416Z INFO 681079 --- [ main] org.atmosphere.cpr.AtmosphereFramework : Installed AtmosphereInterceptor Browser disconnection detection with priority AFTER_DEFAULT
2026-10-07T21:08:12.416Z INFO 681079 --- [ main] org.atmosphere.cpr.AtmosphereFramework : Installed AtmosphereInterceptor org.atmosphere.interceptor.IdleResourceInterceptor with priority BEFORE_DEFAULT
2026-10-07T21:08:12.417Z INFO 681079 --- [ main] org.atmosphere.cpr.AtmosphereFramework : Using EndpointMapper class org.atmosphere.util.DefaultEndpointMapper
2026-10-07T21:08:12.418Z INFO 681079 --- [ main] org.atmosphere.cpr.AtmosphereFramework : Using BroadcasterCache: org.atmosphere.cache.UUIDBroadcasterCache
2026-10-07T21:08:12.418Z INFO 681079 --- [ main] org.atmosphere.cpr.AtmosphereFramework : Default Broadcaster Class: org.atmosphere.cpr.DefaultBroadcaster
2026-10-07T21:08:12.420Z INFO 681079 --- [ main] org.atmosphere.cpr.AtmosphereFramework : Broadcaster Shared List Resources: false
2026-10-07T21:08:12.420Z INFO 681079 --- [ main] org.atmosphere.cpr.AtmosphereFramework : Broadcaster Polling Wait Time 100
2026-10-07T21:08:12.420Z INFO 681079 --- [ main] org.atmosphere.cpr.AtmosphereFramework : Shared ExecutorService supported: true
2026-10-07T21:08:12.420Z INFO 681079 --- [ main] org.atmosphere.cpr.AtmosphereFramework : Messaging ExecutorService Pool Size unavailable - Not instance of ThreadPoolExecutor
2026-10-07T21:08:12.421Z INFO 681079 --- [ main] org.atmosphere.cpr.AtmosphereFramework : Async I/O Thread Pool Size: 200
2026-10-07T21:08:12.421Z INFO 681079 --- [ main] org.atmosphere.cpr.AtmosphereFramework : Using BroadcasterFactory: org.atmosphere.cpr.DefaultBroadcasterFactory
2026-10-07T21:08:12.421Z INFO 681079 --- [ main] org.atmosphere.cpr.AtmosphereFramework : Using AtmosphereResurceFactory: org.atmosphere.cpr.DefaultAtmosphereResourceFactory
2026-10-07T21:08:12.421Z INFO 681079 --- [ main] org.atmosphere.cpr.AtmosphereFramework : Using WebSocketProcessor: org.atmosphere.websocket.DefaultWebSocketProcessor
2026-10-07T21:08:12.428Z INFO 681079 --- [ main] org.atmosphere.cpr.AtmosphereFramework : Invoke AtmosphereInterceptor on WebSocket message true
2026-10-07T21:08:12.429Z INFO 681079 --- [ main] org.atmosphere.cpr.AtmosphereFramework : HttpSession supported: true
2026-10-07T21:08:12.429Z INFO 681079 --- [ main] org.atmosphere.cpr.AtmosphereFramework : Atmosphere is using DefaultAtmosphereObjectFactory for dependency injection and object creation
2026-10-07T21:08:12.429Z INFO 681079 --- [ main] org.atmosphere.cpr.AtmosphereFramework : Atmosphere is using async support: org.atmosphere.container.JSR356AsyncSupport running under container: Apache Tomcat/11.0.21 using jakarta.servlet/3.0 and jsr356/WebSocket API
2026-10-07T21:08:12.429Z INFO 681079 --- [ main] org.atmosphere.cpr.AtmosphereFramework : Atmosphere Framework 3.0.5.slf4jvaadin1 started.
2026-10-07T21:08:12.448Z INFO 681079 --- [ main] org.atmosphere.cpr.AtmosphereFramework : Installed AtmosphereInterceptor Track Message Size Interceptor using | with priority BEFORE_DEFAULT
2026-10-07T21:08:12.531Z INFO 681079 --- [ main] c.v.f.s.DefaultDeploymentConfiguration :
Vaadin is running in DEVELOPMENT mode - do not use for production deployments.
2026-10-07T21:08:12.639Z INFO 681079 --- [in-dev-server-1] c.v.f.s.frontend.TaskUpdatePackages : using '/home/ghrunner/.vaadin/node-v24.15.0/bin/node /home/ghrunner/.vaadin/node-v24.15.0/lib/node_modules/npm/bin/npm-cli.js --no-update-notifier --no-audit --scripts-prepend-node-path=true --ignore-scripts install' for frontend package installation
2026-10-07T21:08:12.950Z INFO 681079 --- [ main] o.s.boot.tomcat.TomcatWebServer : Tomcat started on port 46613 (http) with context path '/'
2026-10-07T21:08:12.962Z INFO 681079 --- [ main] org.vaadin.hugerte.MopoSmokeTest : Started MopoSmokeTest in 11.178 seconds (process running for 47.555)
Mockito is currently self-attaching to enable the inline-mock-maker. This will no longer work in future releases of the JDK. Please add Mockito as an agent to your build as described in Mockito's documentation: https://javadoc.io/doc/org.mockito/mockito-core/latest/org.mockito/org/mockito/Mockito.html#0.3
OpenJDK 64-Bit Server VM warning: Sharing is only supported for boot loader classes because bootstrap classpath has been appended
WARNING: A Java agent has been loaded dynamically (/home/ghrunner/.m2/repository/net/bytebuddy/byte-buddy-agent/1.17.8/byte-buddy-agent-1.17.8.jar)
WARNING: If a serviceability tool is in use, please run with -XX:+EnableDynamicAgentLoading to hide this warning
WARNING: If a serviceability tool is not in use, please run with -Djdk.instrument.traceUsage for more information
WARNING: Dynamic loading of agents will be disallowed by default in a future release
2026-10-07T21:08:16.053Z INFO 681079 --- [o-auto-1-exec-1] o.a.c.c.C.[Tomcat].[localhost].[/] : Initializing Spring DispatcherServlet 'dispatcherServlet'
2026-10-07T21:08:16.054Z INFO 681079 --- [o-auto-1-exec-1] o.s.web.servlet.DispatcherServlet : Initializing Servlet 'dispatcherServlet'
2026-10-07T21:08:16.055Z INFO 681079 --- [o-auto-1-exec-1] o.s.web.servlet.DispatcherServlet : Completed initialization in 1 ms
2026-10-07T21:08:30.148Z INFO 681079 --- [in-dev-server-1] c.v.f.s.frontend.TaskUpdatePackages : Frontend dependencies resolved successfully.
2026-10-07T21:08:30.827Z INFO 681079 --- [in-dev-server-1] c.v.f.s.frontend.TaskCopyFrontendFiles : Copying frontend resources from jar files ...
2026-10-07T21:08:30.959Z INFO 681079 --- [in-dev-server-1] c.v.f.s.f.TaskCopyLocalFrontendFiles : Copied 2 local frontend files. Took 8 ms.
2026-10-07T21:08:31.118Z INFO 681079 --- [in-dev-server-1] c.v.f.s.f.TaskCopyLocalFrontendFiles : Copied 190 local frontend files. Took 158 ms.
2026-10-07T21:08:31.132Z INFO 681079 --- [in-dev-server-1] c.v.f.s.frontend.TaskCopyFrontendFiles : Visited 21 resources. Took 305 ms.
2026-10-07T21:08:31.138Z INFO 681079 --- [in-dev-server-1] c.v.f.s.f.TaskCopyLocalFrontendFiles : Copying project local frontend resources.
2026-10-07T21:08:31.143Z INFO 681079 --- [in-dev-server-1] c.v.f.s.f.TaskCopyLocalFrontendFiles : Copied 2 local frontend files. Took 4 ms.
2026-10-07T21:08:31.143Z INFO 681079 --- [in-dev-server-1] c.v.f.s.f.TaskCopyLocalFrontendFiles : Copying frontend directory completed.
2026-10-07T21:08:31.647Z INFO 681079 --- [onPool-worker-1] c.v.b.devserver.AbstractDevServerRunner : Starting Vite
------------------ Starting Frontend compilation. ------------------
2026-10-07T21:08:31.842Z INFO 681079 --- [onPool-worker-1] c.v.b.devserver.AbstractDevServerRunner : Running Vite to compile frontend resources. This may take a moment, please stand by...
2026-10-07T21:08:32.708Z INFO 681079 --- [v-server-output] c.v.b.devserver.DevServerOutputTracker :
2026-10-07T21:08:32.709Z INFO 681079 --- [v-server-output] c.v.b.devserver.DevServerOutputTracker : VITE v7.3.2 ready in 795 ms
----------------- Frontend compiled successfully. -----------------
2026-10-07T21:08:32.709Z INFO 681079 --- [onPool-worker-1] c.v.b.devserver.AbstractDevServerRunner : Started Vite. Time: 1062ms
2026-10-07T21:08:32.711Z INFO 681079 --- [v-server-output] c.v.b.devserver.DevServerOutputTracker :
2026-10-07T21:08:32.720Z INFO 681079 --- [v-server-output] c.v.b.devserver.DevServerOutputTracker : ➜ Local: http://127.0.0.1:44939/VAADIN/
2026-10-07T21:08:33.433Z INFO 681079 --- [in-dev-server-2] c.v.b.d.DevModeHandlerManagerImpl : Application running at http://localhost:0/
2026-10-07T21:08:36.629Z INFO 681079 --- [v-server-output] c.v.b.devserver.DevServerOutputTracker :
2026-10-07T21:08:36.629Z INFO 681079 --- [v-server-output] c.v.b.devserver.DevServerOutputTracker : ERROR(TypeScript) Option 'baseUrl' is deprecated and will stop functioning in TypeScript 7.0. Specify compilerOption '"ignoreDeprecations": "6.0"' to silence this error.
2026-10-07T21:08:36.629Z INFO 681079 --- [v-server-output] c.v.b.devserver.DevServerOutputTracker : Visit https://aka.ms/ts6 for migration information.
2026-10-07T21:08:36.629Z INFO 681079 --- [v-server-output] c.v.b.devserver.DevServerOutputTracker : FILE /home/ghrunner/actions-runner/_work/vaadin-ecosystem-build/vaadin-ecosystem-build/work/hugerte-for-flow/tsconfig.json:25:5
2026-10-07T21:08:36.629Z INFO 681079 --- [v-server-output] c.v.b.devserver.DevServerOutputTracker :
2026-10-07T21:08:36.630Z INFO 681079 --- [v-server-output] c.v.b.devserver.DevServerOutputTracker : 23 | "experimentalDecorators": true,
2026-10-07T21:08:36.630Z INFO 681079 --- [v-server-output] c.v.b.devserver.DevServerOutputTracker : 24 | "useDefineForClassFields": false,
2026-10-07T21:08:36.630Z INFO 681079 --- [v-server-output] c.v.b.devserver.DevServerOutputTracker : > 25 | "baseUrl": "src/main/frontend",
2026-10-07T21:08:36.630Z INFO 681079 --- [v-server-output] c.v.b.devserver.DevServerOutputTracker : | ^^^^^^^^^
2026-10-07T21:08:36.630Z INFO 681079 --- [v-server-output] c.v.b.devserver.DevServerOutputTracker : 26 | "paths": {
2026-10-07T21:08:36.630Z INFO 681079 --- [v-server-output] c.v.b.devserver.DevServerOutputTracker : 27 | "@vaadin/flow-frontend": ["generated/jar-resources"],
2026-10-07T21:08:36.631Z INFO 681079 --- [v-server-output] c.v.b.devserver.DevServerOutputTracker : 28 | "@vaadin/flow-frontend/*": ["generated/jar-resources/*"],
2026-10-07T21:08:36.631Z INFO 681079 --- [v-server-output] c.v.b.devserver.DevServerOutputTracker :
2026-10-07T21:08:36.631Z INFO 681079 --- [v-server-output] c.v.b.devserver.DevServerOutputTracker : [TypeScript] Found 1 error. Watching for file changes.
Checking autosavepluginexample
Checked autosavepluginexample and it contained no JS errors.
Checking binder
Checked binder and it contained no JS errors.
Checking configurationoptions
Checked configurationoptions and it contained no JS errors.
Checking demo
Checked demo and it contained no JS errors.
Checking detachinvisible
Checked detachinvisible and it contained no JS errors.
Checking editorindialog
Checked editorindialog and it contained no JS errors.
Checking flowtest
Checked flowtest and it contained no JS errors.
Checking fulldemo
Checked fulldemo and it contained no JS errors.
Ignored test 'githubissue2' as flaky
Checking hugerte-attach
Checked hugerte-attach and it contained no JS errors.
Checking hugertewithadditionalconfig
Checked hugertewithadditionalconfig and it contained no JS errors.
Checking hugertewithvaadinselect
Checked hugertewithvaadinselect and it contained no JS errors.
Checking imagepickercallback
Checked imagepickercallback and it contained no JS errors.
Checking imageuploadsenabled
Checked imageuploadsenabled and it contained no JS errors.
Checking issue30
Checked issue30 and it contained no JS errors.
Checking localizationsample
Checked localizationsample and it contained no JS errors.
Checking menuconfig
Checked menuconfig and it contained no JS errors.
Checking preserveonrefreshbug27
Checked preserveonrefreshbug27 and it contained no JS errors.
Checking replaceselectioncontent
Checked replaceselectioncontent and it contained no JS errors.
Checking setvalueafteredit
Checked setvalueafteredit and it contained no JS errors.
Checking sizes
Checked sizes and it contained no JS errors.
Checking themevariants
Checked themevariants and it contained no JS errors.
Checking this/is/long/route
Checked this/is/long/route and it contained no JS errors.
Checking updatevalueondetachededitor
Checked updatevalueondetachededitor and it contained no JS errors.
Checking valuechangemodes
Checked valuechangemodes and it contained no JS errors.
[ERROR] Tests run: 3, Failures: 0, Errors: 1, Skipped: 0, Time elapsed: 121.6 s <<< FAILURE! -- in org.vaadin.hugerte.MopoSmokeTest
[ERROR] org.vaadin.hugerte.MopoSmokeTest.setValueBackToPreviousValueAfterEditUpdatesUi -- Time elapsed: 8.793 s <<< ERROR!
com.microsoft.playwright.TimeoutError:
Error {
message='Timeout 5000ms exceeded.
name='TimeoutError
stack='TimeoutError: Timeout 5000ms exceeded.
at ProgressController.run (/tmp/playwright-java-9226128053181560908/package/lib/server/progress.js:68:28)
at FrameDispatcher._runCommand (/tmp/playwright-java-9226128053181560908/package/lib/server/dispatchers/dispatcher.js:95:31)
at DispatcherConnection.dispatch (/tmp/playwright-java-9226128053181560908/package/lib/server/dispatchers/dispatcher.js:329:39)
}
Call log:
- - waiting for locator("#reset")
- - locator resolved to Reset to A
- - attempting click action
- 2 × waiting for element to be visible, enabled and stable
- - element is visible, enabled and stable
- - scrolling into view if needed
- - done scrolling
- - intercepts pointer events
- - retrying click action
- - waiting 20ms
- 2 × waiting for element to be visible, enabled and stable
- - element is visible, enabled and stable
- - scrolling into view if needed
- - done scrolling
- - intercepts pointer events
- - retrying click action
- - waiting 100ms
- 9 × waiting for element to be visible, enabled and stable
- - element is visible, enabled and stable
- - scrolling into view if needed
- - done scrolling
- - intercepts pointer events
- - retrying click action
- - waiting 500ms
at com.microsoft.playwright.impl.WaitableResult.get(WaitableResult.java:52)
at com.microsoft.playwright.impl.ChannelOwner.runUntil(ChannelOwner.java:138)
at com.microsoft.playwright.impl.Connection.sendMessage(Connection.java:131)
at com.microsoft.playwright.impl.ChannelOwner.sendMessage(ChannelOwner.java:124)
at com.microsoft.playwright.impl.FrameImpl.clickImpl(FrameImpl.java:241)
at com.microsoft.playwright.impl.FrameImpl.click(FrameImpl.java:232)
at com.microsoft.playwright.impl.LocatorImpl.click(LocatorImpl.java:164)
at com.microsoft.playwright.Locator.click(Locator.java:2500)
at org.vaadin.hugerte.MopoSmokeTest.setValueBackToPreviousValueAfterEditUpdatesUi(MopoSmokeTest.java:103)
Caused by: com.microsoft.playwright.TimeoutError: Error {
message='Timeout 5000ms exceeded.
name='TimeoutError
stack='TimeoutError: Timeout 5000ms exceeded.
at ProgressController.run (/tmp/playwright-java-9226128053181560908/package/lib/server/progress.js:68:28)
at FrameDispatcher._runCommand (/tmp/playwright-java-9226128053181560908/package/lib/server/dispatchers/dispatcher.js:95:31)
at DispatcherConnection.dispatch (/tmp/playwright-java-9226128053181560908/package/lib/server/dispatchers/dispatcher.js:329:39)
}
Call log:
- - waiting for locator("#reset")
- - locator resolved to Reset to A
- - attempting click action
- 2 × waiting for element to be visible, enabled and stable
- - element is visible, enabled and stable
- - scrolling into view if needed
- - done scrolling
- - intercepts pointer events
- - retrying click action
- - waiting 20ms
- 2 × waiting for element to be visible, enabled and stable
- - element is visible, enabled and stable
- - scrolling into view if needed
- - done scrolling
- - intercepts pointer events
- - retrying click action
- - waiting 100ms
- 9 × waiting for element to be visible, enabled and stable
- - element is visible, enabled and stable
- - scrolling into view if needed
- - done scrolling
- - intercepts pointer events
- - retrying click action
- - waiting 500ms
at com.microsoft.playwright.impl.Connection.dispatch(Connection.java:257)
at com.microsoft.playwright.impl.Connection.processOneMessage(Connection.java:214)
at com.microsoft.playwright.impl.ChannelOwner.runUntil(ChannelOwner.java:136)
... 7 more
[INFO]
[INFO] Results:
[INFO]
[ERROR] Errors:
[ERROR] MopoSmokeTest.setValueBackToPreviousValueAfterEditUpdatesUi:103 » Timeout Error {
message='Timeout 5000ms exceeded.
name='TimeoutError
stack='TimeoutError: Timeout 5000ms exceeded.
at ProgressController.run (/tmp/playwright-java-9226128053181560908/package/lib/server/progress.js:68:28)
at FrameDispatcher._runCommand (/tmp/playwright-java-9226128053181560908/package/lib/server/dispatchers/dispatcher.js:95:31)
at DispatcherConnection.dispatch (/tmp/playwright-java-9226128053181560908/package/lib/server/dispatchers/dispatcher.js:329:39)
}
Call log:
- - waiting for locator("#reset")
- - locator resolved to Reset to A
- - attempting click action
- 2 × waiting for element to be visible, enabled and stable
- - element is visible, enabled and stable
- - scrolling into view if needed
- - done scrolling
- - intercepts pointer events
- - retrying click action
- - waiting 20ms
- 2 × waiting for element to be visible, enabled and stable
- - element is visible, enabled and stable
- - scrolling into view if needed
- - done scrolling
- - intercepts pointer events
- - retrying click action
- - waiting 100ms
- 9 × waiting for element to be visible, enabled and stable
- - element is visible, enabled and stable
- - scrolling into view if needed
- - done scrolling
- - intercepts pointer events
- - retrying click action
- - waiting 500ms
[INFO]
[ERROR] Tests run: 3, Failures: 0, Errors: 1, Skipped: 0
[INFO]
[WARNING] Corrupted channel by directly writing to native stream in forked JVM 1. See FAQ web page and the dump file /home/ghrunner/actions-runner/_work/vaadin-ecosystem-build/vaadin-ecosystem-build/work/hugerte-for-flow/target/surefire-reports/2026-10-07T21-07-25_237-jvmRun1.dumpstream
[INFO] ------------------------------------------------------------------------
[INFO] BUILD FAILURE
[INFO] ------------------------------------------------------------------------
[INFO] Total time: 02:12 min
[INFO] Finished at: 2026-10-07T21:09:28Z
[INFO] ------------------------------------------------------------------------
[ERROR] Failed to execute goal org.apache.maven.plugins:maven-surefire-plugin:3.2.5:test (default-test) on project hugerte-for-flow:
[ERROR]
[ERROR] Please refer to /home/ghrunner/actions-runner/_work/vaadin-ecosystem-build/vaadin-ecosystem-build/work/hugerte-for-flow/target/surefire-reports for the individual test results.
[ERROR] Please refer to dump files (if any exist) [date].dump, [date]-jvmRun[N].dump and [date].dumpstream.
[ERROR] -> [Help 1]
[ERROR]
[ERROR] To see the full stack trace of the errors, re-run Maven with the -e switch.
[ERROR] Re-run Maven using the -X switch to enable full debug logging.
[ERROR]
[ERROR] For more information about the errors and possible solutions, please read the following articles:
[ERROR] [Help 1] http://cwiki.apache.org/confluence/display/MAVEN/MojoFailureException