{
  "Zoomist Add-on": {
    "repoUrl": "https://github.com/FlowingCode/Zoomist",
    "originalVersion": null,
    "buildsWithOriginal": true,
    "notifyUsers": ["javier-godoy", "scardanzan", "paodb"],
    "failureSignature": "unknown",
    "failureSummary": "Build failed (exit code: 1)\n[ERROR] The build could not read 1 project -> [Help 1]\n[ERROR]   \n[ERROR]   The project com.flowingcode.vaadin.addons:zoomist-addon:1.3.1-SNAPSHOT (/home/ghrunner/actions-runner/_work/vaadin-ecosystem-build/vaadin-ecosystem-build/work/Zoomist Add-on/pom.xml) has 5 errors\n[ERROR]     Non-resolvable import POM: The following artifacts could not be resolved: com.vaadin:vaadin-bom:pom:25.2-SNAPSHOT (present, but unavailable): com.vaadin:vaadin-bom:pom:25.2-20260924.050226-269 was not found in https://maven.vaadin.com/vaadin-prereleases during a previous attempt. This failure was cached in the local repository and resolution is not reattempted until the update interval…\n[ERROR]     'dependencies.dependency.version' for com.vaadin:vaadin-core:jar is missing. @ line 112, column 15\n[ERROR]     'dependencies.dependency.version' for org.slf4j:slf4j-simple:jar is missing. @ line 128, column 15\n[ERROR]     'dependencies.dependency.version' for com.vaadin:vaadin-testbench:jar is missing. @ line 133, column 15\n[ERROR]     'dependencies.dependency.version' for com.vaadin:vaadin-dev:jar is missing. @ line 521, column 17\n[ERROR] \n[ERROR] To see the full stack trace of the errors, re-run Maven with the -e switch.\n[ERROR] Re-run Maven using the -X switch to enable full debug logging.\n[ERROR] For more information about the errors and possible solutions, please read the following articles:\n[ERROR] [Help 1] http://cwiki.apache.org/confluence/display/MAVEN/ProjectBuildingException\n[ERROR] [Help 2] http://cwiki.apache.org/confluence/display/MAVEN/UnresolvableModelException"
  },
  "Badge List Add-on": {
    "repoUrl": "https://github.com/FlowingCode/BadgeList",
    "originalVersion": null,
    "buildsWithOriginal": false,
    "notifyUsers": ["javier-godoy", "scardanzan", "paodb"],
    "failureSignature": "unknown",
    "failureSummary": "Build failed (exit code: 1)\n[ERROR] The build could not read 1 project -> [Help 1]\n[ERROR]   \n[ERROR]   The project com.flowingcode.vaadin.addons:badge-list-addon:1.2.2-SNAPSHOT (/home/ghrunner/actions-runner/_work/vaadin-ecosystem-build/vaadin-ecosystem-build/work/Badge List Add-on/pom.xml) has 5 errors\n[ERROR]     Non-resolvable import POM: The following artifacts could not be resolved: com.vaadin:vaadin-bom:pom:25.2-SNAPSHOT (present, but unavailable): com.vaadin:vaadin-bom:pom:25.2-20260924.050226-269 was not found in https://maven.vaadin.com/vaadin-prereleases during a previous attempt. This failure was cached in the local repository and resolution is not reattempted until the update interval…\n[ERROR]     'dependencies.dependency.version' for com.vaadin:vaadin-core:jar is missing. @ line 112, column 15\n[ERROR]     'dependencies.dependency.version' for org.slf4j:slf4j-simple:jar is missing. @ line 117, column 15\n[ERROR]     'dependencies.dependency.version' for com.vaadin:vaadin-testbench:jar is missing. @ line 122, column 15\n[ERROR]     'dependencies.dependency.version' for com.vaadin:vaadin-dev:jar is missing. @ line 521, column 29\n[ERROR] \n[ERROR] To see the full stack trace of the errors, re-run Maven with the -e switch.\n[ERROR] Re-run Maven using the -X switch to enable full debug logging.\n[ERROR] For more information about the errors and possible solutions, please read the following articles:\n[ERROR] [Help 1] http://cwiki.apache.org/confluence/display/MAVEN/ProjectBuildingException\n[ERROR] [Help 2] http://cwiki.apache.org/confluence/display/MAVEN/UnresolvableModelException"
  },
  "Extended Login Add-on": {
    "repoUrl": "https://github.com/FlowingCode/ExtendedLoginAddon",
    "originalVersion": null,
    "buildsWithOriginal": false,
    "notifyUsers": ["javier-godoy", "scardanzan", "paodb"],
    "failureSignature": "unknown",
    "failureSummary": "Build failed (exit code: 1)\n[ERROR] The build could not read 1 project -> [Help 1]\n[ERROR]   \n[ERROR]   The project org.vaadin.addons.flowingcode:extended-login:1.1.1-SNAPSHOT (/home/ghrunner/actions-runner/_work/vaadin-ecosystem-build/vaadin-ecosystem-build/work/Extended Login Add-on/pom.xml) has 5 errors\n[ERROR]     Non-resolvable import POM: The following artifacts could not be resolved: com.vaadin:vaadin-bom:pom:25.2-SNAPSHOT (present, but unavailable): com.vaadin:vaadin-bom:pom:25.2-20260924.050226-269 was not found in https://maven.vaadin.com/vaadin-prereleases during a previous attempt. This failure was cached in the local repository and resolution is not reattempted until the update interval…\n[ERROR]     'dependencies.dependency.version' for com.vaadin:vaadin-core:jar is missing. @ line 116, column 15\n[ERROR]     'dependencies.dependency.version' for org.slf4j:slf4j-simple:jar is missing. @ line 121, column 15\n[ERROR]     'dependencies.dependency.version' for com.vaadin:vaadin-testbench:jar is missing. @ line 126, column 15\n[ERROR]     'dependencies.dependency.version' for com.vaadin:vaadin-dev:jar is missing. @ line 493, column 17\n[ERROR] \n[ERROR] To see the full stack trace of the errors, re-run Maven with the -e switch.\n[ERROR] Re-run Maven using the -X switch to enable full debug logging.\n[ERROR] For more information about the errors and possible solutions, please read the following articles:\n[ERROR] [Help 1] http://cwiki.apache.org/confluence/display/MAVEN/ProjectBuildingException\n[ERROR] [Help 2] http://cwiki.apache.org/confluence/display/MAVEN/UnresolvableModelException"
  },
  "Image Crop Add-on": {
    "repoUrl": "https://github.com/FlowingCode/ImageCrop",
    "originalVersion": null,
    "buildsWithOriginal": false,
    "notifyUsers": ["javier-godoy", "scardanzan", "paodb"],
    "failureSignature": "unknown",
    "failureSummary": "Build failed (exit code: 1)\n[ERROR] The build could not read 1 project -> [Help 1]\n[ERROR]   \n[ERROR]   The project com.flowingcode.vaadin.addons:image-crop-addon:1.3.0-SNAPSHOT (/home/ghrunner/actions-runner/_work/vaadin-ecosystem-build/vaadin-ecosystem-build/work/Image Crop Add-on/pom.xml) has 5 errors\n[ERROR]     Non-resolvable import POM: The following artifacts could not be resolved: com.vaadin:vaadin-bom:pom:25.2-SNAPSHOT (present, but unavailable): com.vaadin:vaadin-bom:pom:25.2-20260924.050226-269 was not found in https://maven.vaadin.com/vaadin-prereleases during a previous attempt. This failure was cached in the local repository and resolution is not reattempted until the update interval…\n[ERROR]     'dependencies.dependency.version' for com.vaadin:vaadin-core:jar is missing. @ line 106, column 21\n[ERROR]     'dependencies.dependency.version' for org.slf4j:slf4j-simple:jar is missing. @ line 117, column 21\n[ERROR]     'dependencies.dependency.version' for com.vaadin:vaadin-testbench:jar is missing. @ line 122, column 21\n[ERROR]     'dependencies.dependency.version' for com.vaadin:vaadin-dev:jar is missing. @ line 515, column 29\n[ERROR] \n[ERROR] To see the full stack trace of the errors, re-run Maven with the -e switch.\n[ERROR] Re-run Maven using the -X switch to enable full debug logging.\n[ERROR] For more information about the errors and possible solutions, please read the following articles:\n[ERROR] [Help 1] http://cwiki.apache.org/confluence/display/MAVEN/ProjectBuildingException\n[ERROR] [Help 2] http://cwiki.apache.org/confluence/display/MAVEN/UnresolvableModelException"
  },
  "Markdown Editor Add-on": {
    "repoUrl": "https://github.com/FlowingCode/MarkdownEditor",
    "originalVersion": null,
    "buildsWithOriginal": false,
    "notifyUsers": ["javier-godoy", "scardanzan", "paodb"],
    "failureSignature": "unknown",
    "failureSummary": "Build failed (exit code: 1)\n[ERROR] The build could not read 1 project -> [Help 1]\n[ERROR]   \n[ERROR]   The project com.flowingcode.vaadin.addons:markdown-editor-addon:2.0.4-SNAPSHOT (/home/ghrunner/actions-runner/_work/vaadin-ecosystem-build/vaadin-ecosystem-build/work/Markdown Editor Add-on/pom.xml) has 5 errors\n[ERROR]     Non-resolvable import POM: The following artifacts could not be resolved: com.vaadin:vaadin-bom:pom:25.2-SNAPSHOT (present, but unavailable): com.vaadin:vaadin-bom:pom:25.2-20260924.050226-269 was not found in https://maven.vaadin.com/vaadin-prereleases during a previous attempt. This failure was cached in the local repository and resolution is not reattempted until the update interval…\n[ERROR]     'dependencies.dependency.version' for com.vaadin:vaadin-core:jar is missing. @ line 106, column 21\n[ERROR]     'dependencies.dependency.version' for org.slf4j:slf4j-simple:jar is missing. @ line 117, column 21\n[ERROR]     'dependencies.dependency.version' for com.vaadin:vaadin-testbench:jar is missing. @ line 122, column 21\n[ERROR]     'dependencies.dependency.version' for com.vaadin:vaadin-dev:jar is missing. @ line 515, column 29\n[ERROR] \n[ERROR] To see the full stack trace of the errors, re-run Maven with the -e switch.\n[ERROR] Re-run Maven using the -X switch to enable full debug logging.\n[ERROR] For more information about the errors and possible solutions, please read the following articles:\n[ERROR] [Help 1] http://cwiki.apache.org/confluence/display/MAVEN/ProjectBuildingException\n[ERROR] [Help 2] http://cwiki.apache.org/confluence/display/MAVEN/UnresolvableModelException"
  },
  "Chat Assistant Add-on": {
    "repoUrl": "https://github.com/FlowingCode/ChatAssistant",
    "originalVersion": null,
    "buildsWithOriginal": true,
    "notifyUsers": ["javier-godoy", "scardanzan", "paodb"],
    "failureSignature": "unknown",
    "failureSummary": "Build failed (exit code: 1)\n[ERROR] The build could not read 1 project -> [Help 1]\n[ERROR]   \n[ERROR]   The project org.vaadin.addons.flowingcode:chat-assistant-addon:5.1.1-SNAPSHOT (/home/ghrunner/actions-runner/_work/vaadin-ecosystem-build/vaadin-ecosystem-build/work/Chat Assistant Add-on/pom.xml) has 5 errors\n[ERROR]     Non-resolvable import POM: The following artifacts could not be resolved: com.vaadin:vaadin-bom:pom:25.2-SNAPSHOT (present, but unavailable): com.vaadin:vaadin-bom:pom:25.2-20260924.050226-269 was not found in https://maven.vaadin.com/vaadin-prereleases during a previous attempt. This failure was cached in the local repository and resolution is not reattempted until the update interval…\n[ERROR]     'dependencies.dependency.version' for com.vaadin:vaadin-core:jar is missing. @ line 122, column 15\n[ERROR]     'dependencies.dependency.version' for org.slf4j:slf4j-simple:jar is missing. @ line 133, column 15\n[ERROR]     'dependencies.dependency.version' for com.vaadin:vaadin-testbench:jar is missing. @ line 138, column 15\n[ERROR]     'dependencies.dependency.version' for com.vaadin:vaadin-dev:jar is missing. @ line 517, column 17\n[ERROR] \n[ERROR] To see the full stack trace of the errors, re-run Maven with the -e switch.\n[ERROR] Re-run Maven using the -X switch to enable full debug logging.\n[ERROR] For more information about the errors and possible solutions, please read the following articles:\n[ERROR] [Help 1] http://cwiki.apache.org/confluence/display/MAVEN/ProjectBuildingException\n[ERROR] [Help 2] http://cwiki.apache.org/confluence/display/MAVEN/UnresolvableModelException"
  },
  "xsd-validator-ui": {
    "repoUrl": "https://github.com/rucko24/xsd-validator-ui",
    "originalVersion": null,
    "buildsWithOriginal": false,
    "notifyUsers": ["rucko24"],
    "failureSignature": "test: DecompressionServiceTest.testDecompressZip_FiltersProperly",
    "failureSummary": "Failures:\n  DecompressionServiceTest.testDecompressZip_FiltersProperly:100 \nFailed to execute goal org.apache.maven.plugins:maven-surefire-plugin:3.5.6:test (default-test) on project xsd-validator-ui: There are test failures."
  },
  "SimpleTimeline": {
    "repoUrl": "https://github.com/samie/SimpleTimeline",
    "originalVersion": null,
    "buildsWithOriginal": true,
    "notifyUsers": ["samie"],
    "failureSignature": "unknown",
    "failureSummary": "Build failed (exit code: 1)\n[ERROR]   \n[ERROR]   The project org.vaadin.addons.mygroup:simpletimeline:1.0.0 (/home/ghrunner/actions-runner/_work/vaadin-ecosystem-build/vaadin-ecosystem-build/work/SimpleTimeline/pom.xml) has 6 errors\n[ERROR]     Non-resolvable import POM: The following artifacts could not be resolved: com.vaadin:vaadin-bom:pom:25.2-SNAPSHOT (present, but unavailable): com.vaadin:vaadin-bom:pom:25.2-20260924.050226-269 was not found in https://maven.vaadin.com/vaadin-prereleases during a previous attempt. This failure was cached in the local repository and resolution is not reattempted until the update interval…\n[ERROR]     'dependencies.dependency.version' for com.vaadin:flow-server:jar is missing. @ line 87, column 21\n[ERROR]     'dependencies.dependency.version' for com.vaadin:flow-client:jar is missing. @ line 97, column 21\n[ERROR]     'dependencies.dependency.version' for com.vaadin:vaadin-core:jar is missing. @ line 101, column 21\n[ERROR]     'dependencies.dependency.version' for org.slf4j:slf4j-simple:jar is missing. @ line 111, column 21\n[ERROR]     'dependencies.dependency.version' for com.vaadin:vaadin-testbench:jar is missing. @ line 116, column 21\n[ERROR] \n[ERROR] To see the full stack trace of the errors, re-run Maven with the -e switch.\n[ERROR] Re-run Maven using the -X switch to enable full debug logging.\n[ERROR] For more information about the errors and possible solutions, please read the following articles:\n[ERROR] [Help 1] http://cwiki.apache.org/confluence/display/MAVEN/ProjectBuildingException\n[ERROR] [Help 2] http://cwiki.apache.org/confluence/display/MAVEN/UnresolvableModelException"
  },
  "Grid Exporter Add-on": {
    "repoUrl": "https://github.com/FlowingCode/GridExporterAddon",
    "originalVersion": null,
    "buildsWithOriginal": true,
    "notifyUsers": ["javier-godoy", "scardanzan", "paodb"],
    "failureSignature": "unknown",
    "failureSummary": "Build failed (exit code: 1)\n[ERROR] The build could not read 1 project -> [Help 1]\n[ERROR]   \n[ERROR]   The project org.vaadin.addons.flowingcode:grid-exporter-addon:3.1.1-SNAPSHOT (/home/ghrunner/actions-runner/_work/vaadin-ecosystem-build/vaadin-ecosystem-build/work/Grid Exporter Add-on/pom.xml) has 5 errors\n[ERROR]     Non-resolvable import POM: The following artifacts could not be resolved: com.vaadin:vaadin-bom:pom:25.2-SNAPSHOT (present, but unavailable): com.vaadin:vaadin-bom:pom:25.2-20260924.050226-269 was not found in https://maven.vaadin.com/vaadin-prereleases during a previous attempt. This failure was cached in the local repository and resolution is not reattempted until the update interval…\n[ERROR]     'dependencies.dependency.version' for com.vaadin:vaadin-core:jar is missing. @ line 117, column 15\n[ERROR]     'dependencies.dependency.version' for org.slf4j:slf4j-simple:jar is missing. @ line 190, column 15\n[ERROR]     'dependencies.dependency.version' for com.vaadin:vaadin-testbench:jar is missing. @ line 195, column 15\n[ERROR]     'dependencies.dependency.version' for com.vaadin:vaadin-dev:jar is missing. @ line 626, column 17\n[ERROR] \n[ERROR] To see the full stack trace of the errors, re-run Maven with the -e switch.\n[ERROR] Re-run Maven using the -X switch to enable full debug logging.\n[ERROR] For more information about the errors and possible solutions, please read the following articles:\n[ERROR] [Help 1] http://cwiki.apache.org/confluence/display/MAVEN/ProjectBuildingException\n[ERROR] [Help 2] http://cwiki.apache.org/confluence/display/MAVEN/UnresolvableModelException"
  },
  "Year-Month Calendar Add-on": {
    "repoUrl": "https://github.com/FlowingCode/YearMonthCalendarAddon",
    "originalVersion": null,
    "buildsWithOriginal": true,
    "notifyUsers": ["javier-godoy", "scardanzan", "paodb"],
    "failureSignature": "unknown",
    "failureSummary": "Build failed (exit code: 1)\n[ERROR] The build could not read 1 project -> [Help 1]\n[ERROR]   \n[ERROR]   The project org.vaadin.addons.flowingcode:year-month-calendar:4.6.3-SNAPSHOT (/home/ghrunner/actions-runner/_work/vaadin-ecosystem-build/vaadin-ecosystem-build/work/Year-Month Calendar Add-on/pom.xml) has 5 errors\n[ERROR]     Non-resolvable import POM: The following artifacts could not be resolved: com.vaadin:vaadin-bom:pom:25.2-SNAPSHOT (present, but unavailable): com.vaadin:vaadin-bom:pom:25.2-20260924.050226-269 was not found in https://maven.vaadin.com/vaadin-prereleases during a previous attempt. This failure was cached in the local repository and resolution is not reattempted until the update interval…\n[ERROR]     'dependencies.dependency.version' for com.vaadin:vaadin-core:jar is missing. @ line 120, column 15\n[ERROR]     'dependencies.dependency.version' for org.slf4j:slf4j-simple:jar is missing. @ line 136, column 15\n[ERROR]     'dependencies.dependency.version' for com.vaadin:vaadin-testbench:jar is missing. @ line 141, column 15\n[ERROR]     'dependencies.dependency.version' for com.vaadin:vaadin-dev:jar is missing. @ line 561, column 17\n[ERROR] \n[ERROR] To see the full stack trace of the errors, re-run Maven with the -e switch.\n[ERROR] Re-run Maven using the -X switch to enable full debug logging.\n[ERROR] For more information about the errors and possible solutions, please read the following articles:\n[ERROR] [Help 1] http://cwiki.apache.org/confluence/display/MAVEN/ProjectBuildingException\n[ERROR] [Help 2] http://cwiki.apache.org/confluence/display/MAVEN/UnresolvableModelException"
  },
  "Day of Week Selector Add-on": {
    "repoUrl": "https://github.com/FlowingCode/DayOfWeekSelectorAddon",
    "originalVersion": null,
    "buildsWithOriginal": false,
    "notifyUsers": ["javier-godoy", "scardanzan", "paodb"],
    "failureSignature": "unknown",
    "failureSummary": "Build failed (exit code: 1)\n[ERROR] The build could not read 1 project -> [Help 1]\n[ERROR]   \n[ERROR]   The project com.flowingcode.vaadin.addons:day-of-week-selector-addon:1.3.2-SNAPSHOT (/home/ghrunner/actions-runner/_work/vaadin-ecosystem-build/vaadin-ecosystem-build/work/Day of Week Selector Add-on/pom.xml) has 5 errors\n[ERROR]     Non-resolvable import POM: The following artifacts could not be resolved: com.vaadin:vaadin-bom:pom:25.2-SNAPSHOT (present, but unavailable): com.vaadin:vaadin-bom:pom:25.2-20260924.050226-269 was not found in https://maven.vaadin.com/vaadin-prereleases during a previous attempt. This failure was cached in the local repository and resolution is not reattempted until the update interval…\n[ERROR]     'dependencies.dependency.version' for com.vaadin:vaadin-core:jar is missing. @ line 106, column 21\n[ERROR]     'dependencies.dependency.version' for org.slf4j:slf4j-simple:jar is missing. @ line 117, column 21\n[ERROR]     'dependencies.dependency.version' for com.vaadin:vaadin-testbench:jar is missing. @ line 122, column 21\n[ERROR]     'dependencies.dependency.version' for com.vaadin:vaadin-dev:jar is missing. @ line 518, column 29\n[ERROR] \n[ERROR] To see the full stack trace of the errors, re-run Maven with the -e switch.\n[ERROR] Re-run Maven using the -X switch to enable full debug logging.\n[ERROR] For more information about the errors and possible solutions, please read the following articles:\n[ERROR] [Help 1] http://cwiki.apache.org/confluence/display/MAVEN/ProjectBuildingException\n[ERROR] [Help 2] http://cwiki.apache.org/confluence/display/MAVEN/UnresolvableModelException"
  },
  "FontAwesomeIronIconset Add-on": {
    "repoUrl": "https://github.com/FlowingCode/FontAwesomeIronIconset",
    "originalVersion": null,
    "buildsWithOriginal": false,
    "notifyUsers": ["javier-godoy", "scardanzan", "paodb"],
    "failureSignature": "unknown",
    "failureSummary": "Build failed (exit code: 1)\n[ERROR] 'dependencies.dependency.version' for com.vaadin:vaadin-dev:jar is missing. @ line 589, column 17\n @ \n[ERROR] The build could not read 1 project -> [Help 1]\n[ERROR]   \n[ERROR]   The project com.flowingcode.addons:font-awesome-iron-iconset:6.0.2-SNAPSHOT (/home/ghrunner/actions-runner/_work/vaadin-ecosystem-build/vaadin-ecosystem-build/work/FontAwesomeIronIconset Add-on/pom.xml) has 3 errors\n[ERROR]     Non-resolvable import POM: The following artifacts could not be resolved: com.vaadin:vaadin-bom:pom:25.2-SNAPSHOT (present, but unavailable): com.vaadin:vaadin-bom:pom:25.2-20260924.050226-269 was not found in https://maven.vaadin.com/vaadin-prereleases during a previous attempt. This failure was cached in the local repository and resolution is not reattempted until the update interval…\n[ERROR]     'dependencies.dependency.version' for com.vaadin:vaadin-core:jar is missing. @ line 115, column 21\n[ERROR]     'dependencies.dependency.version' for com.vaadin:vaadin-dev:jar is missing. @ line 589, column 17\n[ERROR] \n[ERROR] To see the full stack trace of the errors, re-run Maven with the -e switch.\n[ERROR] Re-run Maven using the -X switch to enable full debug logging.\n[ERROR] For more information about the errors and possible solutions, please read the following articles:\n[ERROR] [Help 1] http://cwiki.apache.org/confluence/display/MAVEN/ProjectBuildingException\n[ERROR] [Help 2] http://cwiki.apache.org/confluence/display/MAVEN/UnresolvableModelException"
  },
  "OrgChart Add-on": {
    "repoUrl": "https://github.com/FlowingCode/OrgChartAddon",
    "originalVersion": null,
    "buildsWithOriginal": true,
    "notifyUsers": ["javier-godoy", "scardanzan", "paodb"],
    "failureSignature": "unknown",
    "failureSummary": "Build failed (exit code: 1)\n[ERROR]   \n[ERROR]   The project com.flowingcode.vaadin.addons:orgchart-addon:5.4.1-SNAPSHOT (/home/ghrunner/actions-runner/_work/vaadin-ecosystem-build/vaadin-ecosystem-build/work/OrgChart Add-on/pom.xml) has 6 errors\n[ERROR]     Non-resolvable import POM: The following artifacts could not be resolved: com.vaadin:vaadin-bom:pom:25.2-SNAPSHOT (present, but unavailable): com.vaadin:vaadin-bom:pom:25.2-20260924.050226-269 was not found in https://maven.vaadin.com/vaadin-prereleases during a previous attempt. This failure was cached in the local repository and resolution is not reattempted until the update interval…\n[ERROR]     'dependencies.dependency.version' for com.vaadin:vaadin-core:jar is missing. @ line 110, column 21\n[ERROR]     'dependencies.dependency.version' for org.slf4j:slf4j-simple:jar is missing. @ line 155, column 21\n[ERROR]     'dependencies.dependency.version' for com.vaadin:vaadin-testbench:jar is missing. @ line 160, column 21\n[ERROR]     'dependencies.dependency.version' for com.vaadin:vaadin-confirm-dialog-flow:jar is missing. @ line 177, column 15\n[ERROR]     'dependencies.dependency.version' for com.vaadin:vaadin-dev:jar is missing. @ line 576, column 29\n[ERROR] \n[ERROR] To see the full stack trace of the errors, re-run Maven with the -e switch.\n[ERROR] Re-run Maven using the -X switch to enable full debug logging.\n[ERROR] For more information about the errors and possible solutions, please read the following articles:\n[ERROR] [Help 1] http://cwiki.apache.org/confluence/display/MAVEN/ProjectBuildingException\n[ERROR] [Help 2] http://cwiki.apache.org/confluence/display/MAVEN/UnresolvableModelException"
  }
}
